program: Gaussian 09
title: 000277916
version: EM64L-G09RevD.01
frameworkgroup: C1[X(C8H15NO)]
method: RPBEPBE
basis: SDD
operation: Freq
keyword: #p
keyword: freq=noraman
keyword: PBEPBE/SDD
title: #p freq=noraman PBEPBE/SDD
converged: YES YES NO NO
title: Mulliken charges:
elementType: O N C C C C C C C C H H H H H H H H H H H H H H H
charge: -0.271916 -0.309000 0.031504 -0.443454 -0.480033 -0.407501 -0.397894 -0.446109 0.132980 -0.713724 0.184623 0.195487 0.206011 0.219623 0.229524 0.209495 0.224685 0.227714 0.202316 0.202783 0.239496 0.316176 0.213566 0.210391 0.223256
chargesum: 0.00000
title: Mulliken charges with hydrogens summed into heavy atoms:
elementType: O N C C C C C C C C
charge: -0.271916 0.007176 0.216127 -0.041956 -0.030886 0.026679 0.032137 -0.003830 0.132980 -0.066512
polarizability: 1.03579077e+02 1.38730742e-01 9.22094367e+01 -6.30594976e+00 1.97668229e+00 8.00454139e+01
1716.lowfreq: -17.4422 -0.0009 -0.0008 0.0005 11.0621 15.8586 63.4526 98.5451 117.8431
frequency: 63.0469 98.4076 117.7750 180.7717 222.7019 253.2334 272.5945 301.0505 341.5679 407.7055 443.8262 463.5288 525.6435 586.2804 655.6839 701.9122 709.5396 768.5277 808.1823 851.9261 860.7931 898.7699 921.8905 984.4013 1010.7934 1027.0458 1046.8287 1072.2802 1096.4400 1104.4128 1162.6148 1185.5768 1200.5981 1230.6881 1247.7982 1277.2491 1297.7943 1310.7679 1322.2837 1343.8897 1351.9204 1355.5862 1370.0328 1386.5814 1392.9588 1413.7165 1453.5242 1464.1401 1469.9489 1475.5162 1478.8788 1480.7314 1486.9978 1621.0071 2940.8315 2960.2674 2970.7761 2973.7566 2976.6338 2980.7777 2987.8496 3016.6608 3031.0861 3044.6319 3052.8900 3066.4319 3073.2294 3083.4833 3527.3486
redmass: 4.7440 2.0629 2.9668 1.4700 1.9781 2.7301 2.1836 2.8572 2.8110 2.0114 2.3254 3.0419 2.7121 1.3891 1.9617 3.7485 2.4006 2.3637 1.6377 1.6902 2.0753 2.0356 2.0553 1.9566 1.7300 1.7951 2.1185 2.2042 2.0225 1.4820 2.1168 1.7595 1.1887 1.3624 1.2550 1.1956 1.3445 1.3447 1.4610 1.4194 1.5213 1.4518 1.4472 1.5644 1.2878 1.8108 1.1111 1.0814 1.0744 1.0633 1.0797 1.0853 1.0882 5.2360 1.0764 1.0660 1.0437 1.0614 1.0671 1.0617 1.0637 1.0967 1.0995 1.1014 1.0959 1.1005 1.0987 1.0948 1.0764
irintensity: 1.4045 0.5581 0.4625 0.0667 0.2718 1.7665 0.7800 1.5565 0.6727 2.2728 1.1831 6.4024 10.6137 71.5608 35.7828 20.0534 12.0859 8.7016 1.7332 2.2669 8.5030 2.4124 5.5256 10.0867 8.9808 5.1466 0.7903 6.5302 4.9309 7.7674 4.2159 4.8601 14.6757 17.7086 0.8856 0.3046 3.1646 3.5937 13.2944 7.6273 24.4358 4.0946 4.5149 55.4333 1.4659 15.7455 25.9690 6.3196 10.4231 6.5937 13.3956 28.6976 14.1469 329.7332 15.6175 33.1887 36.6537 86.6946 24.6781 10.6187 27.7918 53.3381 7.9440 50.6153 40.3523 74.4568 42.7258 16.1007 14.1103
temp: 298.150 k
press: 1.00000 atm
elementType: 8 7 6 6 6 6 6 6 6 6 1 1 1 1 1 1 1 1 1 1 1 1 1 1 1
symmnumber: 1
zpe: 581774.0 jmol-1
zpe.correction: 0.221586 hartree
zpe.thermalcorrener: 0.231898 hartree
zpe.thermalcorrenthalpy: 0.232842 hartree
zpe.thermalcorrgfe: 0.186131 hartree
zpe.sumelectzpe: -443.030807 hartree
zpe.sumelectthermal: -443.020496 hartree
zpe.sumelectthermalent: -443.019552 hartree
zpe.sumelectthermalfe: -443.066262 hartree
dipole: -3.5605 2.2328 2.0132
dipole: 4.6600
quadrupole: -70.3252 -62.7116 -61.8506
quadrupole: 8.8597 3.3368 -3.2146
quadrupole: -5.3627 2.2508 3.1118 8.8597 3.3368 -3.2146
hfenergy: -443.2523934 hartree
pointgroup: C01 [X(C8H15N1O1)]
dipole: -1.4743988 0.7564519 0.7843777 debye
dipolederiv: -0.9198834 0.1265912 0.261209 0.3544771 -0.7095045 -0.175344 0.3992782 -0.1383428 -0.5457609 -1.0473982 0.119787 0.2323579 -0.2733878 -0.327578 0.2226073 0.1971543 0.0345295 -0.5801102 0.072778 -0.0007941 -0.0091079 -0.0016374 0.0465992 0.0028357 -0.0049397 0.0464593 0.057095 0.0447284 -0.0070598 0.0066532 -0.0115129 0.0969644 0.0374944 -0.016314 0.0087043 0.1113799 0.4431375 -0.1457463 -0.0602216 -0.179096 0.2313118 0.0749163 -0.0993964 0.0614092 0.3061675 0.078233 -0.0631159 0.0275817 -0.02491 0.0966014 -0.0132277 0.0325808 -0.0232134 0.1052972 0.0970712 -0.0365527 -0.0097276 -0.0263267 0.0450793 0.0035435 0.0126977 0.0023908 0.0437996 0.013586 0.0724799 0.0114886 0.0201712 -0.2676801 -0.0064152 0.0277073 -0.0201078 0.1226749 1.3424034 -0.0358087 -0.6170373 0.0877626 0.8912489 0.0169132 -0.7220301 0.160884 0.4880488 0.0328008 -0.0834769 -0.013496 -0.0949296 0.0004154 0.0009728 -0.0257761 -0.0146085 0.0592554 -0.1434562 0.0441655 0.1296453 0.0482979 0.0202425 -0.0331519 0.1033939 -0.0309847 -0.0575007 0.0083788 -0.0776917 -0.0541562 -0.0571096 -0.0005581 -0.0718167 -0.0225315 -0.1279406 -0.1478385 -0.0734736 0.1207151 -0.0549308 0.0992718 -0.0487372 0.0717889 -0.0660242 0.1151708 0.0164496 -0.0484525 -0.0208539 -0.1072579 0.0242969 0.0136375 -0.1493291 -0.0310461 -0.0874205 -0.0925288 -0.0204879 -0.0572364 0.100014 -0.0756501 -0.0882118 0.0881878 0.0751674 0.0431613 0.0694437 -0.0127959 -0.0675562 0.0255302 -0.0819163 -0.1845335 0.0659123 0.0107651 0.045816 0.0698613 0.0322221 0.0234706 -0.0490813 0.0228035 0.0534816 -0.1005503 -0.0481274 -0.0517353 -0.1147651 -0.0579288 0.024425 0.1212271 0.0114333 0.040075 -0.0480701 0.1076148 -0.0322041 -0.0041212 0.0029964 0.052071 -0.0714106 0.0744685 -0.0940485 0.1124922 -0.0724282 0.0898964 -0.0088665 0.1133694 0.0131746 0.0255065 0.0041966 0.0169968 -0.0336502 -0.0498503 -0.0480916 -0.1390759 -0.0969944 -0.0321683 0.0477458 0.0025659 0.0557564 0.0083054 0.0809 0.0322923 0.0687575 0.1666368 -0.0350343 0.0946049 -0.014405 0.1105823 -0.0360586 0.1194917 -0.061386 0.2457876 0.0266999 0.1107757 -0.0555908 0.0796449 -0.0796405 0.0933158 -0.0323379 0.1211678 0.0260075 -0.0681733 0.0229772 0.1012439 0.0785307 0.0416731 -0.0606563 0.1513146 -0.0278409 -0.0047664 0.0140021 -0.0675376 -0.0827898 -0.0670394 0.0398266 -0.0710155 -0.1272639 -0.0980057 -0.0946914 unknown
polarizability: 103.5918557|1.0869729|92.2866832|-6.2337867|1.5499803|79.9553887 unknown
InChI: InChI=1S/C8H15NO/c1-2-7-4-3-5-8(10)9-6-7/h7,9H,2-6H2,1H3
charge 0 multiplicity 1
25 atoms
O  2.505666 -1.371656 -0.673562
N  0.554846 -1.190978 0.55392
C  -1.330619 0.534267 0.48307
C  -0.550047 1.848821 0.204621
C  -0.486785 -0.475493 1.313884
C  0.765404 1.71313 -0.601291
C  -1.918439 -0.096666 -0.80586
C  1.869791 0.872175 0.098749
C  1.682506 -0.640895 -0.037753
C  -2.922272 -1.240903 -0.540875
H  -2.186851 0.813031 1.137277
H  -0.310046 2.32811 1.177556
H  -1.223206 2.549314 -0.329774
H  -0.029459 0.062144 2.170121
H  -1.1523 -1.24457 1.744293
H  1.168248 2.731243 -0.767039
H  0.567288 1.292229 -1.605787
H  -1.097243 -0.471475 -1.446414
H  -2.425876 0.702696 -1.382351
H  1.920094 1.156379 1.170102
H  2.853362 1.089548 -0.349262
H  0.456834 -2.200755 0.420919
H  -2.442707 -2.103557 -0.041656
H  -3.7552 -0.899663 0.102901
H  -3.35789 -1.611473 -1.486491
