program: Gaussian 09
title: 000277918
version: EM64L-G09RevD.01
frameworkgroup: C1[X(C12H12O2)]
method: RPBEPBE
basis: SDD
operation: Freq
keyword: #pfreq=noraman
keyword: PBEPBE/SDD
title: #p freq=noraman PBEPBE/SDD
converged: YES YES NO NO
title: Mulliken charges:
elementType: O O C C C C C C C C C C C C H H H H H H H H H H H H
charge: -0.439830 -0.253236 -0.538842 -0.459518 0.296731 -0.460643 -0.372574 0.357164 -0.506015 -0.373489 0.252653 -0.220565 -0.344909 0.094079 0.226038 0.230249 0.224825 0.219131 0.218659 0.220867 0.228103 0.282326 0.229581 0.230171 0.276042 0.383003
chargesum: 0.00000
title: Mulliken charges with hydrogens summed into heavy atoms:
elementType: O O C C C C C C C C C C C C
charge: -0.056827 -0.253236 -0.082555 -0.015561 0.296731 -0.021117 -0.144470 0.357164 -0.223689 -0.143908 0.252653 0.009606 -0.068868 0.094079
polarizability: 2.14278938e+02 -5.06708829e+00 1.43175667e+02 3.44374082e+00 8.88002347e-01 6.70872603e+01
1716.lowfreq: -7.0726 -0.0005 -0.0004 -0.0003 3.9158 9.6740 39.6908 56.0005 98.2966
frequency: 39.6575 55.9907 98.2808 102.3405 152.5969 160.8747 212.7257 249.9543 300.6197 358.8978 407.2208 421.3901 438.3074 512.2552 540.9115 594.0628 605.6663 629.0117 661.0846 691.6098 730.6951 759.8683 804.5762 821.7391 826.0267 864.9372 894.9814 912.7416 936.6362 950.3609 970.1764 985.4982 996.6483 998.0537 1042.9580 1046.9266 1062.5341 1094.3638 1128.4049 1145.7228 1183.6740 1189.3342 1203.6782 1257.0386 1266.0969 1284.1003 1294.1620 1307.7496 1322.6706 1345.0365 1387.6570 1426.2069 1460.1587 1464.3532 1479.8364 1482.0457 1583.3921 1610.0225 1636.0568 1643.0257 2958.6048 2966.0984 3004.9633 3022.0560 3030.9926 3077.4151 3132.5706 3144.8300 3154.4362 3160.4720 3181.2230 3530.3998
redmass: 2.9993 8.3465 4.1662 4.1155 1.8486 4.1062 4.8038 2.9333 6.1115 5.2630 3.4372 3.6662 3.4632 5.3865 2.1219 4.7074 1.4309 2.5612 4.1328 2.1507 3.5492 5.7944 1.7395 1.5190 1.6129 3.5946 1.5876 2.5493 1.4788 1.5077 2.0278 4.8961 4.0975 1.3818 2.0414 2.0512 1.8611 1.6841 1.1909 1.5983 1.2839 1.2432 1.2336 1.4191 1.6038 1.4457 1.6174 1.4250 1.8646 2.9646 7.5356 3.6383 1.0992 1.1080 1.5134 1.5423 5.9648 6.1359 6.8472 8.5367 1.0653 1.0637 1.0720 1.0923 1.0902 1.1040 1.0872 1.0946 1.0941 1.0913 1.0963 1.0641
irintensity: 0.1240 1.6672 0.8263 0.7409 1.9222 0.1512 0.4959 0.1956 2.3353 1.6982 3.9581 5.4155 1.1904 12.1867 31.7805 56.7272 77.0119 37.8718 17.3684 1.6021 78.4931 5.4914 27.4580 22.7144 7.1561 10.1606 5.1716 0.4784 2.0731 11.5143 20.8609 4.1339 71.2709 0.8453 105.3506 102.9738 1.0664 10.0147 2.6469 125.2047 2.1740 6.5820 3.2099 3.6391 2.7078 34.4072 3.1623 8.0511 69.3672 13.8883 19.6501 33.6752 6.9788 8.1361 5.7859 11.1417 22.8919 26.7108 14.9234 234.4387 52.0776 30.0361 22.6848 39.2979 41.1905 49.8675 9.6529 6.5752 24.2583 3.2718 5.1452 45.9157
temp: 298.150 k
press: 1.00000 atm
elementType: 8 8 6 6 6 6 6 6 6 6 6 6 6 6 1 1 1 1 1 1 1 1 1 1 1 1
symmnumber: 1
zpe: 546679.4 jmol-1
zpe.correction: 0.208219 hartree
zpe.thermalcorrener: 0.220414 hartree
zpe.thermalcorrenthalpy: 0.221358 hartree
zpe.thermalcorrgfe: 0.168772 hartree
zpe.sumelectzpe: -613.924627 hartree
zpe.sumelectthermal: -613.912432 hartree
zpe.sumelectthermalent: -613.911488 hartree
zpe.sumelectthermalfe: -613.964074 hartree
dipole: -1.2108 1.7330 0.0147
dipole: 2.1142
quadrupole: -67.9212 -80.4357 -84.7991
quadrupole: 1.8943 0.5970 -0.1202
quadrupole: 9.7975 -2.7170 -7.0805 1.8943 0.5970 -0.1202
hfenergy: -614.1328457 hartree
pointgroup: C01 [X(C12H12O2)]
dipole: -0.4745892 -0.6810043 0.0533068 debye
dipolederiv: -1.4563419 0.1373933 0.0138142 0.2377518 -0.3116631 -0.0073488 0.0066739 -0.006098 -0.4258386 -0.7113743 -0.1328447 0.0114827 -0.1590984 -1.0977767 0.0280799 0.0102153 0.0262935 -0.3287916 -0.0696339 0.0408726 -0.0063735 0.0244038 -0.0282775 0.0317113 -0.0342856 0.0340656 0.1809092 0.0094541 -0.0679383 -0.0020619 -0.0531552 0.0747575 0.0635245 0.0508319 0.0104528 0.1381321 -0.1542189 0.0304533 0.0025409 -0.1965473 0.198501 -0.0550217 0.112112 -0.0224483 -0.084658 -0.0805955 0.0627402 0.0274046 0.0090594 0.0085702 0.0582706 0.1155954 0.0564551 0.167509 0.1580224 -0.0599863 -0.0345474 -0.0250698 -0.02106 -0.0512011 -0.1387008 -0.0554082 -0.2090801 0.6157083 -0.1276017 -0.0310271 -0.0803213 -0.2163953 0.0336031 -0.0738047 0.0243706 0.033777 -0.1280884 0.2082749 0.0000093 -0.1721441 0.0165138 0.0006575 -0.0022942 -0.0005588 -0.1368909 -0.0959289 0.0687207 0.0134115 0.1482237 0.0295054 -0.0017064 0.0192427 -0.0065788 -0.1238543 -0.3735171 -0.3075995 0.0151493 -0.332301 -0.2891742 0.0128049 0.0280232 0.0128801 0.0120418 -0.1739355 -0.0679734 0.001036 -0.1020348 0.1695692 -0.003256 -0.0013379 -0.0065257 -0.1478791 -0.0679127 -0.0216649 0.0034744 0.2212372 0.0134035 -0.007744 -0.0075292 -0.0033662 -0.1325944 2.0041281 0.2820852 -0.0394456 0.3374736 1.430279 -0.0453562 -0.0362652 -0.0424419 0.2265824 0.0258498 -0.0344119 -0.0623503 -0.0504006 -0.0312362 -0.0693471 -0.0670754 -0.1060928 -0.0584906 0.0034132 -0.0635006 0.0884461 -0.0448593 0.0236791 0.0618475 0.0881308 0.0803385 -0.0473399 0.0415608 -0.0019214 -0.0378514 -0.0244246 0.0660849 -0.0124349 -0.0956129 0.0399603 -0.1606524 -0.0229498 0.104383 0.0301301 0.1436208 -0.1125143 -0.0513666 0.0586213 -0.079371 0.0545961 -0.1366497 -0.0764898 -0.0714741 -0.0392723 0.0146338 -0.0406296 -0.1684074 -0.0438891 0.0400172 -0.0325138 0.0050479 0.0794281 0.1225025 0.0518948 -0.028818 0.1263211 -0.002112 -0.136045 0.0840758 0.0537361 -0.0031028 0.0620205 -0.1172855 0.064199 0.0054559 0.0644099 0.1456307 0.147544 0.0274103 0.0012297 0.0703965 -0.004066 0.0026584 0.0009699 0.0043019 0.1423148 -0.011813 -0.119896 -0.000734 -0.0834753 0.0233912 0.0007572 -0.0014971 0.0063408 0.1349447 0.0612755 0.0401998 -0.0004095 0.0504217 -0.120176 0.0053839 -0.0019006 0.0044594 0.1535961 0.000014 0.0505771 0.0008563 0.0513485 0.1071034 -0.0001139 0.0022883 0.0010879 0.1643088 0.3644272 -0.030066 0.0009644 -0.1153559 0.1217378 0.0108464 0.0042292 0.0094746 0.3977551 unknown
polarizability: 214.1430889|4.8401061|142.8686357|-5.6679165|-5.0964963|67.5301404 unknown
InChI: InChI=1S/C12H12O2/c13-12(14)11-7-3-6-10(8-11)9-4-1-2-5-9/h3-4,6-8,13H,1-2,5H2
charge 0 multiplicity 1
26 atoms
O  4.279649 0.467359 -0.100866
O  2.797903 2.252898 -0.13649
C  -2.275557 1.404371 -0.210152
C  -3.823265 1.368713 -0.393938
C  -1.897743 -0.062388 0.01859
C  -4.28636 0.028566 0.260438
C  -3.017353 -0.803806 0.278977
C  -0.496036 -0.532252 0.005635
C  0.57213 0.400814 -0.043037
C  -0.162254 -1.919975 0.036555
C  1.922391 -0.029522 -0.050041
C  1.179267 -2.350249 0.031128
C  2.233762 -1.411484 -0.011096
C  2.982781 1.011352 -0.099274
H  -1.983018 2.017475 0.667496
H  -1.763235 1.842696 -1.08717
H  -4.065194 1.351154 -1.472281
H  -4.321921 2.25031 0.044451
H  -5.109553 -0.455676 -0.298823
H  -4.660343 0.184146 1.294693
H  -3.025515 -1.869469 0.533425
H  0.376182 1.477363 -0.069954
H  -0.964188 -2.666201 0.053341
H  1.405575 -3.421733 0.053874
H  3.279223 -1.730695 -0.01898
H  4.934372 1.215335 -0.134599
