program: Gaussian 09
title: 000278037
version: EM64L-G09RevD.01
frameworkgroup: C1[X(C27H18N2O4)]
method: RPBEPBE
basis: SDD
operation: Freq
keyword: #p
keyword: freq=noraman
keyword: PBEPBE/SDD
title: #p freq=noraman PBEPBE/SDD
converged: YES YES NO NO
title: Mulliken charges:
elementType: O O O O N N C C C C C C C C C C C C C C C C C C C C C C C C C C C H H H H H H H H H H H H H H H H H H
charge: -0.266614 -0.247417 -0.409186 -0.281701 -0.449997 -0.478085 0.256238 0.317118 0.356040 0.104545 0.547131 -0.690282 -0.374661 -0.028711 -0.423787 -0.378252 -0.349210 0.194609 0.135741 0.220257 0.015441 -0.237466 -0.245107 -0.365417 -0.375613 0.131635 -0.361706 -0.225604 -0.235229 -0.346429 -0.214825 -0.226549 0.087999 0.243505 0.221239 0.327325 0.308670 0.226077 0.276210 0.383979 0.228518 0.233704 0.249616 0.269233 0.263814 0.234413 0.236294 0.270243 0.240765 0.241754 0.389736
chargesum: 0.00000
title: Mulliken charges with hydrogens summed into heavy atoms:
elementType: O O O O N N C C C C C C C C C C C C C C C C C C C C C C C C C C C
charge: -0.266614 -0.247417 -0.019450 -0.281701 -0.122672 -0.094106 0.256238 0.317118 0.356040 0.104545 0.547131 -0.446777 -0.153422 -0.028711 -0.115117 -0.152175 -0.073000 0.194609 0.135741 0.220257 0.015441 -0.008948 -0.011404 -0.115801 -0.106380 0.131635 -0.097892 0.008809 0.001065 -0.076185 0.025940 0.015205 0.087999
polarizability: 5.02976235e+02 -4.03746225e+01 3.13522199e+02 -3.14455883e+01 -2.27272393e+01 2.42159118e+02
1716.lowfreq: -4.9684 -0.0006 0.0002 0.0006 1.6722 5.6838 15.6667 18.7277 35.7127
frequency: 15.3498 18.6599 35.7045 46.6117 56.5443 68.6025 75.2934 95.4541 99.7161 108.7491 117.5751 122.8355 139.9882 151.2726 172.0970 212.2345 222.9491 235.1722 269.4511 279.4372 282.5006 298.3506 319.6763 344.4526 356.3362 384.3905 391.6214 399.0339 426.9462 431.1992 447.8942 453.9541 486.7734 505.1213 525.9924 528.7770 547.4018 562.4550 589.3138 601.1634 608.5283 613.1237 617.8338 633.7251 647.3464 648.6700 677.8919 693.1589 701.9550 706.0173 723.2673 727.6177 741.1728 763.2002 765.6064 773.7078 780.6334 782.7507 784.3106 790.6286 793.3688 815.0612 850.4829 856.5654 867.1877 888.5053 890.9628 897.1463 899.2616 955.6668 962.8868 972.4238 976.0126 984.1457 992.3762 993.6121 996.0161 1003.3322 1004.3241 1022.8223 1037.6091 1040.2617 1048.6417 1083.8792 1091.9793 1118.4952 1119.6969 1137.3567 1151.9367 1164.4009 1175.5963 1176.0012 1179.6841 1211.7572 1242.2261 1250.3253 1259.3846 1274.9963 1283.4446 1289.9733 1292.1669 1318.7574 1327.5786 1333.0590 1361.2841 1364.5969 1372.8333 1390.3713 1392.4753 1421.0062 1432.1984 1440.1441 1460.6605 1462.9208 1471.0971 1491.3600 1522.7192 1533.3889 1563.7454 1570.5932 1576.2895 1591.5926 1593.8686 1604.1171 1610.7015 1612.5988 1625.0297 1630.2474 1636.5351 3121.9546 3127.6669 3130.4726 3138.0746 3140.5902 3145.1845 3151.0692 3151.4047 3153.3085 3159.6157 3163.1188 3168.9048 3169.9648 3176.7176 3200.4612 3292.5072 3512.9616 3518.6126
redmass: 6.3847 6.3277 7.1299 5.9169 6.3244 7.7332 5.1142 4.8341 7.4762 5.4185 6.5285 5.0979 5.5854 6.6033 6.0968 6.5217 5.1942 6.1155 5.6194 6.8202 5.8310 5.2665 7.2353 6.6869 5.0927 6.5781 4.7236 3.4665 3.4130 7.2147 6.5471 3.0420 7.0828 5.0387 4.7649 3.4313 4.0282 3.7100 5.6323 3.0232 5.8554 2.3420 2.7174 2.8361 6.4098 2.5827 5.4137 5.7893 4.7814 4.7261 2.1596 5.2990 1.8161 4.5683 1.8663 2.2837 4.5268 2.2630 1.9813 2.1910 2.5632 4.9129 1.6181 1.4709 5.1738 1.4378 1.5428 1.4259 1.3766 3.2989 1.4698 1.4023 1.3834 1.3370 7.1343 7.0352 1.3414 1.3494 1.3384 5.0564 2.4079 2.3095 2.2988 2.8013 2.6748 1.6461 2.0299 2.2292 1.3766 1.7473 1.0591 1.0850 1.0649 1.6262 1.8830 1.6313 1.8685 1.8062 1.8760 1.7588 4.5328 2.8419 2.0048 2.9489 2.7608 5.2629 9.6264 6.2716 9.9201 2.0686 2.3302 3.0632 2.5374 2.4966 3.0358 3.0430 3.3218 3.3135 6.2118 6.3470 6.8127 8.0793 6.9995 6.2303 7.0055 6.2021 2.5714 4.3030 5.7293 1.0917 1.0865 1.0857 1.0863 1.0894 1.0895 1.0906 1.0907 1.0944 1.0928 1.0954 1.1006 1.1000 1.0998 1.0950 1.0828 1.0641 1.0763
irintensity: 0.1458 0.8563 0.4239 1.4308 0.9396 3.9187 1.0902 1.8548 2.1031 2.1085 7.0035 0.0442 0.1763 0.1485 0.6123 0.5664 2.9823 6.0886 2.6086 1.9875 3.8267 1.9279 1.1462 5.1897 2.0752 9.8256 3.4882 3.4428 2.9430 8.3019 3.2108 7.8791 5.0376 4.3763 1.4615 0.2283 21.6139 9.1458 11.1765 32.6038 8.5900 38.8574 35.7554 0.0245 14.7999 4.1693 17.3928 10.8780 41.8359 16.4330 19.1653 11.2458 98.7801 4.5081 60.8555 35.4079 8.8181 35.9102 38.9869 22.5030 0.4806 4.9639 26.0250 4.3003 18.3899 0.4741 1.2974 7.3435 158.4528 9.4443 1.8302 9.1889 4.1018 0.6418 3.4372 13.4302 1.6050 1.1647 0.6454 163.7682 3.6963 17.9861 36.6354 5.2781 21.1260 36.1967 17.5838 37.4268 5.5016 82.4057 1.0743 0.8262 0.2759 14.9696 34.4486 2.8394 24.9794 57.5599 9.9956 1.5827 30.3300 202.9333 17.4876 110.2734 135.8848 99.3078 9.8474 112.4929 8.1821 11.3072 3.4971 5.9675 44.9218 18.6871 185.2503 17.1048 2.9913 367.4940 130.6057 50.7935 13.7367 109.9731 111.8962 16.0460 266.5595 140.2731 18.6658 310.9831 213.1367 7.7378 1.3106 5.4183 1.3575 6.5298 10.0429 6.1287 1.1040 14.1973 17.5723 7.8093 32.3505 33.6975 13.3321 7.9321 331.0215 49.9801 25.4489
temp: 298.150 k
press: 1.00000 atm
elementType: 8 8 8 8 7 7 6 6 6 6 6 6 6 6 6 6 6 6 6 6 6 6 6 6 6 6 6 6 6 6 6 6 6 1 1 1 1 1 1 1 1 1 1 1 1 1 1 1 1 1 1
symmnumber: 1
zpe: 1006026.7 jmol-1
zpe.correction: 0.383175 hartree
zpe.thermalcorrener: 0.409287 hartree
zpe.thermalcorrenthalpy: 0.410232 hartree
zpe.thermalcorrgfe: 0.325183 hartree
zpe.sumelectzpe: -1447.930192 hartree
zpe.sumelectthermal: -1447.904080 hartree
zpe.sumelectthermalent: -1447.903136 hartree
zpe.sumelectthermalfe: -1447.988184 hartree
dipole: 4.9507 1.6764 1.5728
dipole: 5.4583
quadrupole: -175.8866 -189.1564 -179.5505
quadrupole: 22.8071 -16.0324 2.9705
quadrupole: 5.6446 -7.6252 1.9807 22.8071 -16.0324 2.9705
hfenergy: -1448.3133671 hartree
pointgroup: C01 [X(C27H18N2O4)]
dipole: -1.9799502 0.8315099 0.0047628 debye
polarizability: 498.76756|60.9181622|266.2332973|-6.2895332|37.4737418|293.6566957 unknown
InChI: InChI=1S/C27H18N2O4/c30-25(21-10-4-1-7-17(21)18-8-3-6-12-23(18)27(32)33)28-16-13-14-20-19-9-2-5-11-22(19)26(31)29-24(20)15-16/h1-15,28-29,32H
charge 0 multiplicity 1
51 atoms
O  5.097117 1.09928 2.73359
O  -1.671421 -2.072484 -2.315952
O  -2.846884 1.859787 3.288692
O  -2.147441 -0.113384 2.305173
N  3.194044 0.355911 1.635395
N  -1.02971 -1.082859 -0.26771
C  3.184747 -0.429806 -0.680871
C  4.631221 -0.173152 -0.738679
C  2.483355 -0.151921 0.535396
C  5.302804 0.349129 0.415469
C  0.361497 -0.889066 -0.450428
C  1.093137 -0.377794 0.647477
C  2.419435 -0.945442 -1.762387
C  4.568984 0.635946 1.67374
C  1.040097 -1.17925 -1.67207
C  5.414262 -0.42148 -1.904609
C  6.697264 0.607793 0.391101
C  -3.991776 -0.483731 -0.063127
C  -3.3622 -1.634268 -0.616994
C  -3.440692 0.910036 -0.21179
C  -1.954882 -1.606058 -1.169205
C  6.795042 -0.162541 -1.919907
C  7.447066 0.355429 -0.768746
C  -5.282052 -0.622533 0.513064
C  -4.048005 -2.873349 -0.641776
C  -2.982981 1.69451 0.89066
C  -3.544271 1.537686 -1.478373
C  -5.942459 -1.869801 0.525325
C  -5.331489 -2.99709 -0.070917
C  -2.707067 3.078257 0.730509
C  -3.225988 2.903725 -1.645824
C  -2.827524 3.683651 -0.535632
C  -2.641995 1.042954 2.179904
H  0.578936 -0.162892 1.592701
H  2.915563 -1.176386 -2.710104
H  2.692109 0.548027 2.507395
H  0.475604 -1.58603 -2.511769
H  4.941385 -0.820999 -2.806853
H  7.156074 1.005755 1.302165
H  -1.405794 -0.834416 0.66531
H  7.372609 -0.363197 -2.829288
H  8.523639 0.554382 -0.78797
H  -5.77719 0.263472 0.926659
H  -3.554504 -3.734037 -1.104582
H  -3.895716 0.947322 -2.330982
H  -6.936713 -1.955048 0.977193
H  -5.84805 -3.962601 -0.086001
H  -2.375853 3.657484 1.59745
H  -3.306966 3.361218 -2.637698
H  -2.600754 4.747481 -0.658848
H  -2.539313 1.387281 4.109724
