program: Gaussian 09
title: 000277911
version: EM64L-G09RevD.01
frameworkgroup: C1[X(C11H16N2O2S)]
method: RPBEPBE
basis: SDD
operation: Freq
keyword: #p
keyword: freq=noraman
keyword: PBEPBE/SDD
title: #p freq=noraman PBEPBE/SDD
converged: YES YES NO NO
title: Mulliken charges:
elementType: S O O N N C C C C C C C C C C C H H H H H H H H H H H H H H H H
charge: 0.961335 -0.538924 -0.513367 0.061012 -0.504860 0.250129 -0.691082 -0.702990 -0.696520 -0.268480 -0.009377 -0.252544 -0.232920 -0.201652 -0.206775 -0.216366 0.228097 0.217222 0.208140 0.224705 0.227735 0.200053 0.218102 0.229996 0.206278 0.211209 0.299136 0.285628 0.285561 0.241982 0.242037 0.237502
chargesum: 0.00000
title: Mulliken charges with hydrogens summed into heavy atoms:
elementType: S O O N N C C C C C C C C C C C
charge: 0.961335 -0.538924 -0.513367 0.061012 -0.205725 0.250129 -0.037623 -0.050497 -0.042144 -0.057271 -0.009377 0.033084 0.052640 0.040330 0.035263 0.021137
polarizability: 2.15209316e+02 -5.93154525e+00 1.67784127e+02 1.16683631e+01 1.05311723e+01 1.36605363e+02
1716.lowfreq: -8.9294 0.0016 0.0016 0.0021 3.4794 5.5306 18.9892 26.9880 30.6538
frequency: 18.7136 26.8741 30.2732 58.7682 77.9028 114.6584 144.4643 163.1899 176.8997 192.4378 206.2318 241.9940 251.0939 257.9097 264.1547 292.6783 331.5968 339.6319 349.4123 379.3311 391.5194 404.2949 424.7887 464.7292 491.1772 501.2298 560.6657 602.3281 655.3696 688.9535 733.3723 761.7938 791.1252 814.1559 850.7040 896.5979 922.2728 924.9170 935.5482 939.0077 950.1722 953.1415 977.5119 984.5225 1002.9160 1005.4604 1009.4855 1018.0113 1033.4554 1050.9569 1078.2059 1173.4809 1178.1260 1202.1823 1207.3290 1272.2033 1289.7312 1304.6409 1366.1725 1371.7464 1376.7674 1384.4477 1403.3048 1438.6110 1452.6187 1454.6079 1463.8808 1464.7686 1475.7188 1481.1317 1494.9943 1577.8158 1590.5019 1605.3692 2960.4959 2971.1023 2974.1326 2987.3843 3065.7617 3070.3971 3079.0560 3081.7835 3086.1278 3094.0454 3137.8924 3150.3048 3159.7465 3169.4864 3177.3226 3228.1739
redmass: 4.5718 4.0031 2.9008 4.5886 4.1378 4.8814 7.1705 3.9056 6.2517 1.1837 3.8763 4.8466 2.6496 1.2006 1.1228 3.2689 3.6316 2.5147 4.0328 3.5286 5.2117 2.8187 6.1795 2.4591 3.5806 4.0598 3.2598 6.4793 6.2110 2.3299 2.5510 1.4411 2.7073 13.3770 1.2437 1.7752 1.7692 1.9410 1.3808 1.5745 1.2068 7.6522 6.0687 1.3950 2.7907 1.4822 3.8236 1.4359 1.4559 2.1849 1.5501 1.0558 1.1236 2.7244 2.3314 1.6853 1.7764 1.2948 1.4438 1.1826 1.1992 8.2245 1.2290 2.2807 2.0271 1.0507 1.0480 1.0465 1.0514 1.0571 1.0782 5.8435 7.9339 7.0123 1.0838 1.0346 1.0367 1.0359 1.0998 1.0992 1.1008 1.1001 1.0995 1.0993 1.0860 1.0889 1.0931 1.0969 1.1010 1.0742
irintensity: 1.0790 0.3857 0.4702 0.6660 1.6262 0.6240 0.8361 9.6842 4.5164 1.3103 10.2105 9.9077 6.7168 0.8269 0.4695 4.2782 0.4337 0.8836 29.8990 6.2016 15.2338 0.0963 85.4394 7.4726 59.7163 50.4404 2.6523 0.0944 1.7887 32.4144 114.0637 69.4360 55.8247 87.2428 0.2139 9.8838 25.1721 31.0406 2.8836 22.6845 0.1390 45.2202 0.8622 0.0670 13.9235 2.0614 4.4989 1.8874 0.4033 22.9336 3.4901 0.0032 6.7990 11.0434 13.3004 9.6339 14.5790 3.3584 13.5829 17.9825 16.6016 6.6945 9.4967 16.3618 13.8770 0.1500 0.7966 0.7693 12.7810 14.4612 24.0424 2.6132 15.8166 0.1714 42.3935 28.4484 57.2243 16.6811 2.1160 58.5601 13.8906 7.9347 87.4300 32.9702 1.4637 11.8229 3.1508 4.2522 22.7885 6.4517
temp: 298.150 k
press: 1.00000 atm
elementType: 16 8 8 7 7 6 6 6 6 6 6 6 6 6 6 6 1 1 1 1 1 1 1 1 1 1 1 1 1 1 1 1
symmnumber: 1
zpe: 658902.9 jmol-1
zpe.correction: 0.250963 hartree
zpe.thermalcorrener: 0.269021 hartree
zpe.thermalcorrenthalpy: 0.269965 hartree
zpe.thermalcorrgfe: 0.203165 hartree
zpe.sumelectzpe: -1085.345989 hartree
zpe.sumelectthermal: -1085.327931 hartree
zpe.sumelectthermalent: -1085.326987 hartree
zpe.sumelectthermalfe: -1085.393787 hartree
dipole: 1.9021 4.4256 -2.1811
dipole: 5.2878
quadrupole: -88.3820 -106.2337 -105.6991
quadrupole: -15.4430 1.5507 6.9725
quadrupole: 11.7229 -6.1288 -5.5941 -15.4430 1.5507 6.9725
hfenergy: -1085.5969516 hartree
pointgroup: C01 [X(C11H16N2O2S1)]
dipole: 0.7605195 -1.8823149 0.4544719 debye
polarizability: 215.6770745|8.6952315|161.4661005|-6.946444|16.7755477|142.4556308 unknown
InChI: InChI=1S/C11H16N2O2S/c1-11(2,3)9-12-13-16(14,15)10-7-5-4-6-8-10/h4-9,13H,1-3H3
charge 0 multiplicity 1
32 atoms
S  -1.171423 1.646212 0.155417
O  -2.021174 2.585005 1.176944
O  -0.6599 2.188699 -1.289237
N  1.256106 0.413937 0.522837
N  0.29847 1.07967 1.264056
C  3.564607 -0.438353 0.205378
C  4.033287 -1.583562 1.154458
C  3.027571 -1.03016 -1.118228
C  4.764702 0.513336 -0.079152
C  2.498251 0.366494 0.935092
C  -2.054289 0.00583 -0.1011
C  -3.01095 -0.376982 0.852007
C  -1.732155 -0.738531 -1.246151
C  -3.687295 -1.599991 0.636878
C  -2.418981 -1.959684 -1.43935
C  -3.388189 -2.386881 -0.501054
H  3.203972 -2.281527 1.368134
H  4.854488 -2.152956 0.680737
H  4.406487 -1.185122 2.116913
H  2.167137 -1.696393 -0.934056
H  2.688136 -0.230501 -1.799708
H  3.824134 -1.609341 -1.620887
H  5.585657 -0.04986 -0.560363
H  4.46686 1.335138 -0.754814
H  5.160017 0.957364 0.854327
H  2.831263 0.884164 1.860378
H  0.577751 1.923086 1.816354
H  -3.225549 0.263459 1.713419
H  -0.986448 -0.37001 -1.956923
H  -4.444233 -1.933147 1.354323
H  -2.19688 -2.572188 -2.319227
H  -3.917028 -3.333007 -0.659608
