program: Gaussian 09
title: 000278036
version: EM64L-G09RevD.01
frameworkgroup: C1[X(C27H15Cl2NO2)]
method: RPBEPBE
basis: SDD
operation: Freq
keyword: #p
keyword: freq=noraman
keyword: PBEPBE/SDD
title: #p freq=noraman PBEPBE/SDD
converged: YES YES NO NO
title: Mulliken charges:
elementType: Cl Cl O O N C C C C C C C C C C C C C C C C C C C C C C C C C C C H H H H H H H H H H H H H H H
charge: -0.051096 -0.061391 -0.195209 -0.198363 -0.364378 0.315999 -0.702375 0.342853 0.280987 0.220892 -0.552828 0.509645 -0.320165 -0.373016 -0.401784 -0.380633 0.017559 0.017452 0.119036 0.122366 0.298440 0.297467 -0.105562 -0.227706 -0.364660 -0.363653 -0.398315 -0.398386 -0.239849 -0.239611 -0.237637 -0.237214 0.252113 0.255978 0.270270 0.279786 0.268175 0.272357 0.256485 0.252268 0.252470 0.277772 0.277351 0.236718 0.236792 0.241172 0.241429
chargesum: 0.00000
title: Mulliken charges with hydrogens summed into heavy atoms:
elementType: Cl Cl O O N C C C C C C C C C C C C C C C C C C C C C C C C C C C
charge: -0.051096 -0.061391 -0.195209 -0.198363 -0.364378 0.315999 -0.194284 0.342853 0.280987 0.220892 -0.282558 0.509645 -0.320165 -0.093231 -0.133609 -0.108277 0.017559 0.017452 0.119036 0.122366 0.298440 0.297467 -0.105562 0.028779 -0.086888 -0.086302 -0.146048 -0.145916 -0.003130 -0.002820 0.003535 0.004216
polarizability: 5.34568856e+02 1.76736215e+00 2.93418428e+02 -1.06858285e+00 -4.62328481e+00 2.33715670e+02
1716.lowfreq: -5.7300 -1.2583 -0.0017 0.0003 0.0016 1.2021 14.1379 16.6187 27.3132
frequency: 14.0908 16.5929 27.3089 57.5023 62.9664 70.7747 79.4959 98.8214 120.9610 124.3931 138.3507 144.1027 171.5124 195.1627 208.9229 212.9348 239.1782 258.3145 284.0347 284.4178 303.4801 338.0674 347.9273 349.1264 371.3657 393.5513 395.7920 422.0463 432.1711 441.4938 445.0296 463.7585 492.9923 497.3780 536.3488 537.6561 557.4730 560.3080 563.3604 575.6797 600.3215 614.8845 629.6962 661.7459 663.5293 681.6104 697.1168 698.9442 708.3867 746.4489 747.8220 761.9636 776.2808 780.9743 787.6989 788.3668 830.9353 846.9078 854.9069 857.1817 868.2830 884.3960 888.7419 895.5500 901.2474 942.1636 957.5343 966.0271 967.2864 972.6887 992.3590 994.8955 998.5587 998.9306 1046.4350 1056.0595 1066.5577 1073.1753 1100.0391 1116.8383 1124.0871 1130.3261 1135.4883 1142.0963 1178.7859 1180.9554 1183.0212 1196.6598 1208.7312 1227.2295 1243.0471 1257.1299 1266.0921 1279.5381 1282.7917 1289.4001 1303.2695 1364.8495 1373.8152 1375.5481 1381.4547 1418.7505 1422.5154 1426.3206 1427.6760 1432.4687 1441.1424 1471.5853 1476.9751 1497.3413 1552.2512 1563.9099 1571.4853 1579.9861 1589.6396 1592.6205 1608.2774 1608.9409 1610.2287 1624.2108 2987.2432 3032.7399 3135.2108 3136.9565 3148.4117 3151.1775 3158.6072 3161.4907 3163.1785 3164.9471 3171.0471 3175.3363 3175.7989 3186.7963 3188.5186
redmass: 7.8258 8.3212 7.0615 9.2427 8.4809 5.3939 5.7886 7.5876 6.3251 6.8745 6.6710 8.9748 6.7707 4.8039 11.3373 5.0978 2.2006 6.1526 8.2015 5.4275 10.7997 7.1261 5.5341 7.4525 8.7375 5.6010 8.2945 5.3801 3.0861 4.6542 4.8536 4.8181 7.8667 3.5293 4.3866 4.6338 3.4807 6.4448 4.9238 5.9588 4.3201 6.9672 5.7903 6.5460 6.4458 6.0788 3.9181 5.3610 4.8812 1.8952 5.5744 3.6793 4.3226 2.3375 2.1917 2.1491 1.5010 6.4634 3.8339 2.4151 1.6402 1.4087 1.4429 1.4907 2.3913 5.3951 1.6647 1.6802 1.3897 1.4053 7.1848 7.1307 1.3599 1.3528 3.1742 2.3046 2.0203 2.4355 2.1155 2.2277 1.9420 3.1832 1.1456 2.1211 1.4685 1.0642 1.0822 2.3249 1.6654 3.5884 2.1735 1.8776 1.9060 2.5749 1.5143 2.5310 3.0112 3.8992 7.8814 9.3370 6.5748 2.2066 2.2710 1.5340 2.2039 4.8876 2.8071 2.3431 4.2635 2.9884 10.0111 7.5028 8.5570 7.9604 8.2027 8.2502 6.2235 7.2706 7.7250 8.5111 1.0609 1.0994 1.0860 1.0858 1.0903 1.0898 1.0932 1.0951 1.0948 1.0895 1.0936 1.0999 1.1000 1.0963 1.0936
irintensity: 0.7027 0.2454 0.3852 2.0529 1.5487 0.5796 0.0142 2.1190 3.5841 2.8026 0.2059 0.8284 0.5630 1.8421 0.4597 0.0062 7.2528 0.6557 4.2036 3.7704 14.5581 3.7053 1.3981 1.6097 13.4528 7.5621 12.0389 1.4896 5.6796 1.7082 3.5312 2.3072 3.2264 0.4159 3.0247 1.2394 7.7862 1.0263 2.0605 0.3907 4.4254 1.9405 27.5626 5.4192 4.8088 13.9728 9.8628 6.4576 23.0199 95.3003 21.5907 10.4062 7.7193 4.5732 8.4520 32.3108 37.5367 29.5075 36.8202 56.4697 3.4150 0.1951 1.7386 1.6684 14.0897 5.1967 3.0009 5.7374 3.9598 0.0422 21.0991 0.8999 0.6490 1.0218 24.0068 13.0666 35.2221 8.2328 1.1944 7.8873 113.5187 25.4878 0.2826 17.4790 22.7327 0.0999 1.6719 7.5272 8.9689 196.2598 23.9785 8.4450 21.4863 167.3469 15.5621 13.2108 111.2721 16.7080 11.1652 13.2849 14.6371 16.0518 8.2421 33.7642 28.8277 35.0211 123.2886 11.5675 1.1342 0.1723 162.0538 6.5779 64.3028 23.6123 96.5413 62.7407 14.0853 2.5278 27.7009 14.2621 7.6697 4.0331 3.1196 1.6489 16.5966 0.2190 2.2801 2.9839 22.1100 1.6432 2.7939 25.5949 13.9231 3.2432 1.7987
temp: 298.150 k
press: 1.00000 atm
elementType: 17 17 8 8 7 6 6 6 6 6 6 6 6 6 6 6 6 6 6 6 6 6 6 6 6 6 6 6 6 6 6 6 1 1 1 1 1 1 1 1 1 1 1 1 1 1 1
symmnumber: 1
zpe: 887847.0 jmol-1
zpe.correction: 0.338163 hartree
zpe.thermalcorrener: 0.363127 hartree
zpe.thermalcorrenthalpy: 0.364071 hartree
zpe.thermalcorrgfe: 0.281139 hartree
zpe.sumelectzpe: -2161.095707 hartree
zpe.sumelectthermal: -2161.070743 hartree
zpe.sumelectthermalent: -2161.069799 hartree
zpe.sumelectthermalfe: -2161.152731 hartree
dipole: -6.1933 0.8489 -1.8222
dipole: 6.5114
quadrupole: -175.0730 -180.5612 -204.3176
quadrupole: -0.1033 3.0717 -7.2074
quadrupole: 11.5776 6.0894 -17.6670 -0.1033 3.0717 -7.2074
hfenergy: -2161.4338699 hartree
pointgroup: C01 [X(C27H15Cl2N1O2)]
dipole: 2.4333544 0.4470121 0.6646543 debye
polarizability: 534.5283618|2.6227604|293.7649169|-2.937979|-1.232291|233.4096763 unknown
InChI: InChI=1S/C27H15Cl2NO2/c28-17-9-10-19-15(12-17)11-16-13-18(14-24(29)25(16)19)30-26(31)22-7-3-1-5-20(22)21-6-2-4-8-23(21)27(30)32/h1-10,12-14H,11H2
charge 0 multiplicity 1
47 atoms
Cl -2.887239 -1.825439 -2.899692
Cl -8.923026 0.47589 0.926163
O  1.235246 1.153578 -2.237914
O  1.092064 -1.059314 1.864487
N  1.194893 0.034372 -0.193067
C  -2.47055 0.42443 0.554294
C  -3.548428 0.977224 1.474852
C  -3.075082 -0.295817 -0.527864
C  -4.834608 0.513195 0.810425
C  -4.542309 -0.238634 -0.37131
C  -1.080491 0.549299 0.676275
C  -0.261532 -0.064469 -0.298185
C  -2.219096 -0.887944 -1.479285
C  -0.820027 -0.785277 -1.377087
C  -6.159053 0.73992 1.219839
C  -5.597935 -0.769679 -1.149827
C  1.847981 0.853667 -1.177058
C  1.801079 -0.697415 0.885888
C  3.144619 1.527475 -0.82823
C  3.19919 -1.220263 0.720716
C  4.261759 0.932835 -0.171784
C  4.317843 -0.503751 0.203621
C  -7.189981 0.19907 0.422798
C  -6.934465 -0.546645 -0.74667
C  3.213396 2.883914 -1.252903
C  3.36218 -2.561398 1.167535
C  5.398985 1.751404 0.085223
C  5.56148 -1.190577 0.100935
C  5.444423 3.102369 -0.304157
C  5.705523 -2.529225 0.50884
C  4.346853 3.673396 -0.990074
C  4.600045 -3.219505 1.059001
H  -3.497374 2.080629 1.553811
H  -3.447728 0.580254 2.503812
H  -0.626418 1.088806 1.51119
H  -0.173389 -1.240721 -2.129796
H  -6.393271 1.312951 2.121812
H  -5.394885 -1.346345 -2.054737
H  -7.766018 -0.946943 -1.333491
H  6.247933 1.321804 0.626517
H  6.419576 -0.668353 -0.334002
H  2.358131 3.295511 -1.796822
H  2.49504 -3.067367 1.601976
H  6.328748 3.706298 -0.074613
H  6.672456 -3.031541 0.39866
H  4.373216 4.719729 -1.31091
H  4.700842 -4.257295 1.392509
