program: Gaussian 09
title: 000277947
version: EM64L-G09RevD.01
frameworkgroup: C1[X(C17H19NO2)]
method: RPBEPBE
basis: SDD
operation: Freq
keyword: #p
keyword: freq=noraman
keyword: PBEPBE/SDD
title: #p freq=noraman PBEPBE/SDD
converged: YES YES NO NO
title: Mulliken charges:
elementType: O O N C C C C C C C C C C C C C C C C C H H H H H H H H H H H H H H H H H H H
charge: -0.314782 -0.272242 -0.466266 -0.015286 -0.470575 -0.470041 -0.413984 -0.432687 -0.377878 0.248603 0.337939 0.159088 0.433676 -0.385751 -0.337847 -0.471091 -0.232968 -0.425034 -0.273698 -0.243429 0.230782 0.203922 0.220268 0.208992 0.244017 0.218614 0.201114 0.223153 0.208273 0.228905 0.245564 0.332965 0.300300 0.193244 0.238306 0.227478 0.239318 0.228784 0.230253
chargesum: 0.00000
title: Mulliken charges with hydrogens summed into heavy atoms:
elementType: O O N C C C C C C C C C C C C C C C C C
charge: -0.314782 -0.272242 -0.133301 0.215495 -0.046386 -0.017032 0.005744 -0.001261 0.096590 0.248603 0.337939 0.159088 0.433676 -0.085451 -0.144603 -0.232784 -0.005490 -0.185716 -0.044914 -0.013175
polarizability: 2.88853694e+02 9.18249319e+00 2.13738016e+02 -2.33468113e+01 -1.09932391e+00 1.14042922e+02
1716.lowfreq: -25.5036 -10.0144 -4.4132 -1.5146 -0.0006 -0.0005 -0.0004 13.7742 22.2155
frequency: -22.1385 11.9381 21.8192 49.8402 59.6449 70.8555 114.4097 138.0470 177.4740 189.8264 223.6011 251.1814 272.5556 274.2487 322.2009 387.5469 418.3768 420.3402 441.4986 471.9671 509.5071 518.6777 548.7730 558.5315 602.4468 622.2268 628.4128 646.1050 666.5526 698.7464 740.8675 748.3552 780.0990 782.2594 783.5348 808.4548 832.4598 857.6919 861.0106 870.1570 888.5429 894.7489 906.3895 924.3862 924.5597 952.1085 971.5125 985.6106 989.2266 992.6468 1023.5890 1029.4777 1033.9486 1060.7567 1070.5444 1094.9049 1106.1524 1150.9982 1155.5074 1161.5355 1182.3655 1187.2078 1195.6965 1209.0287 1228.7353 1235.7911 1249.6808 1270.1018 1272.7105 1289.4823 1292.7427 1302.0495 1306.1415 1316.3538 1341.5730 1359.0498 1369.9533 1409.0138 1420.2831 1444.1913 1454.6187 1458.1579 1466.6398 1471.6042 1473.5816 1487.1578 1495.0243 1541.8552 1591.9427 1598.7180 1635.0837 1665.2276 2973.2989 2989.1955 2989.7521 2995.0790 3008.2142 3012.8024 3052.8454 3054.3883 3061.5385 3074.2527 3084.0055 3111.4868 3125.0641 3130.0423 3142.9805 3154.0668 3163.6755 3189.7454 3564.7600
redmass: 2.6493 4.3593 3.9533 3.2585 6.4566 4.9374 4.1810 4.1039 4.0784 3.9438 5.4464 3.1593 3.2792 2.4695 4.9315 2.2843 2.9892 4.2042 3.7597 3.3761 7.0497 6.5623 1.8373 2.4143 2.7285 4.9873 1.6251 3.4261 6.1367 5.5514 1.2894 5.7853 2.0292 5.4392 2.0672 1.4270 1.9689 2.5549 2.6802 1.8504 1.5595 5.2908 2.5013 2.0844 1.3773 1.4011 2.9781 1.3309 2.1802 1.3570 1.4748 1.9709 2.6607 2.6721 1.5955 2.3137 2.7714 1.6677 1.6613 1.9584 1.1183 1.8205 1.2918 1.3689 1.3086 1.8959 1.1487 1.3481 1.6168 2.3215 1.3644 1.2313 1.2202 1.4477 1.3994 1.4365 2.0194 2.8627 5.4941 2.4959 2.2221 1.1121 1.0863 1.0905 1.0807 1.1046 2.6071 2.7489 7.3828 5.2705 6.2568 7.0743 1.0653 1.0625 1.0632 1.0725 1.0634 1.0697 1.0980 1.0972 1.1032 1.1053 1.1076 1.0865 1.0876 1.0868 1.0938 1.0966 1.1003 1.0944 1.0749
irintensity: 0.0121 0.0455 0.5098 0.1131 4.1759 1.0810 1.9213 0.4547 2.7905 1.1833 0.8192 2.5113 3.4287 2.0292 24.7422 1.8288 10.4567 6.8606 8.0947 0.1109 0.3413 0.1549 4.4895 0.0875 1.5488 6.8748 28.4804 4.4133 8.9092 43.1408 26.1683 2.4265 6.4292 4.4692 67.5510 75.9442 5.5338 6.1114 7.6422 17.0579 4.7913 0.8664 5.6358 5.4365 2.8787 1.7838 172.6280 1.1347 38.6363 4.6089 1.5571 16.1099 71.7403 149.2465 20.7455 27.6255 1.1767 172.5651 4.2468 236.8866 8.7059 13.6413 2.4688 1.5745 6.2108 3.8229 9.3125 0.0580 19.2308 22.6981 0.7482 0.9019 0.0971 2.3334 3.3853 23.5834 33.5446 32.4261 91.2007 2.0838 0.3572 14.8608 3.6984 6.7448 10.0204 12.8416 385.1134 446.0509 49.1621 10.1695 10.5583 231.7728 32.1551 43.7141 31.6213 14.6037 6.9471 70.6749 40.8549 27.2117 22.7143 79.3906 27.0214 17.6951 0.8709 2.0198 31.5220 32.9841 28.7322 4.2786 29.1760
temp: 298.150 k
press: 1.00000 atm
elementType: 8 8 7 6 6 6 6 6 6 6 6 6 6 6 6 6 6 6 6 6 1 1 1 1 1 1 1 1 1 1 1 1 1 1 1 1 1 1 1
symmnumber: 1
zpe: 848142.5 jmol-1
zpe.correction: 0.323040 hartree
zpe.thermalcorrener: 0.339834 hartree
zpe.thermalcorrenthalpy: 0.340778 hartree
zpe.thermalcorrgfe: 0.275708 hartree
zpe.sumelectzpe: -862.984828 hartree
zpe.sumelectthermal: -862.968034 hartree
zpe.sumelectthermalent: -862.967090 hartree
zpe.sumelectthermalfe: -863.032161 hartree
dipole: 0.2929 -2.2117 0.4365
dipole: 2.2733
quadrupole: -99.4604 -111.8635 -122.5684
quadrupole: -2.1665 -3.2902 1.3039
quadrupole: 11.8370 -0.5661 -11.2709 -2.1665 -3.2902 1.3039
hfenergy: -863.3078683 hartree
pointgroup: C01 [X(C17H19N1O2)]
dipole: 0.1376898 -0.7559875 -0.4576876 debye
polarizability: 287.4561005|25.8962243|171.1967547|-12.4655074|49.1823022|157.9817773 unknown
InChI: InChI=1S/C17H19NO2/c19-17(20-12-13-6-1-2-7-13)18-16-11-5-9-14-8-3-4-10-15(14)16/h3-5,8-11,13,18H,1-2,6-7,12H2
charge 0 multiplicity 1
39 atoms
O  1.919649 -0.02558 -1.266885
O  1.358272 1.643015 0.310755
N  -0.207846 0.073399 -0.543727
C  4.249506 -0.599802 -0.602583
C  5.754732 -0.243145 -0.858697
C  4.086671 -0.653502 0.957002
C  6.473678 -0.5286 0.484306
C  5.420402 -0.108449 1.538547
C  3.339044 0.429413 -1.287607
C  1.037851 0.667819 -0.413942
C  -1.417797 0.42016 0.112864
C  -2.604477 -0.353393 -0.204346
C  -3.845032 -0.013989 0.466511
C  -1.48185 1.470127 1.043086
C  -2.620266 -1.436428 -1.147046
C  -3.875545 1.062214 1.412379
C  -2.714125 1.783605 1.686933
C  -5.029583 -0.766668 0.168904
C  -3.790957 -2.150755 -1.416265
C  -5.010594 -1.814653 -0.751866
H  4.020539 -1.590529 -1.038966
H  5.850993 0.835435 -1.100208
H  6.180026 -0.80695 -1.708019
H  3.935287 -1.699223 1.282829
H  3.213022 -0.072963 1.302297
H  7.430787 0.014957 0.579996
H  6.690079 -1.610906 0.579577
H  5.635666 -0.499173 2.549035
H  5.384846 0.996301 1.610032
H  3.583614 0.530371 -2.359749
H  3.398121 1.415873 -0.792128
H  -0.222691 -0.707678 -1.199966
H  -0.579682 2.042569 1.266252
H  -1.712544 -1.733856 -1.686159
H  -4.820534 1.306011 1.910606
H  -2.734257 2.60779 2.40806
H  -5.959636 -0.498503 0.684158
H  -3.774368 -2.97216 -2.140648
H  -5.923104 -2.380056 -0.969024
