program: Gaussian 09
title: 000277909
version: EM64L-G09RevD.01
frameworkgroup: C1[X(C12H18N2O2S)]
method: RPBEPBE
basis: SDD
operation: Freq
keyword: #p
keyword: freq=noraman
keyword: PBEPBE/SDD
title: #p freq=noraman PBEPBE/SDD
converged: YES YES NO NO
title: Mulliken charges:
elementType: S O O N N C C C C C C C C C C C C H H H H H H H H H H H H H H H H H H
charge: 0.957960 -0.542624 -0.517167 -0.495334 0.002541 0.194846 -0.037105 -0.470675 -0.494020 -0.242322 -0.229134 0.451766 -0.362852 -0.365726 -0.674216 -0.672218 -0.799671 0.204986 0.237922 0.208459 0.228868 0.293341 0.282195 0.285947 0.242566 0.242351 0.208219 0.224608 0.239766 0.248545 0.221415 0.224039 0.229734 0.229458 0.243529
chargesum: 0.00000
title: Mulliken charges with hydrogens summed into heavy atoms:
elementType: S O O N N C C C C C C C C C C C C
charge: 0.957960 -0.542624 -0.517167 -0.201993 0.002541 0.194846 -0.037105 -0.027767 -0.056693 0.039873 0.056813 0.451766 -0.120286 -0.123375 -0.001623 0.021782 -0.096950
polarizability: 2.40558746e+02 1.99044778e+00 1.73787418e+02 -8.19710798e+00 1.21330385e+01 1.53040538e+02
1716.lowfreq: -16.9584 0.0013 0.0014 0.0014 4.5368 7.5971 20.2862 23.9573 30.3483
frequency: 18.5688 23.7528 30.0287 32.0968 55.8681 75.7462 90.7711 99.8783 128.5513 137.5968 154.1084 193.2354 206.0633 219.1195 229.3940 243.2812 256.2977 290.1273 305.9391 361.4590 376.6793 388.3951 407.4610 408.9801 428.9260 470.6985 509.7668 544.8146 586.5802 620.7940 655.0025 707.3069 708.9692 774.8177 777.7263 787.2282 809.3762 828.3439 848.8822 849.9554 941.3096 949.0228 956.8981 965.4996 982.5289 990.1218 995.7646 1010.0650 1036.4285 1043.3750 1049.2590 1054.2663 1075.3840 1119.5764 1126.6340 1185.2952 1217.6997 1218.3029 1252.5343 1266.7596 1291.4104 1297.3788 1311.4474 1337.7957 1381.6106 1388.0441 1391.9670 1395.2855 1398.4824 1457.1272 1471.2470 1473.6092 1474.0552 1475.0689 1476.4430 1478.3601 1485.3196 1493.3575 1582.0741 1595.6946 1596.3576 2946.5999 2975.2408 2980.3488 2983.5490 2987.6382 3047.9033 3060.2795 3062.9795 3082.2032 3086.7126 3090.2247 3092.1682 3092.7366 3135.6248 3137.9814 3164.1506 3170.6645 3202.4732
redmass: 3.9666 1.0406 3.8205 3.6426 3.7225 3.0119 4.4575 2.9058 5.8105 3.3514 3.6805 2.1427 1.4044 3.8899 2.4034 2.1672 4.2808 4.2052 3.8638 2.7416 3.4083 7.6736 2.8548 4.3477 3.8159 5.4092 3.0964 2.6682 5.3300 6.9555 3.6113 3.2708 3.2351 1.6861 2.3509 1.3071 7.6777 1.3705 1.4334 1.5182 2.5870 4.2130 2.1370 1.4373 1.4039 1.4192 5.1205 2.7566 1.5208 1.8968 1.5975 2.4942 1.8014 1.2932 1.9530 1.1413 2.2268 2.0533 1.1886 1.3534 1.2331 1.2627 1.3873 2.0288 6.1375 1.1988 2.9912 1.2048 1.2207 1.0825 1.1001 1.4688 1.4490 1.0439 1.0477 1.0604 1.0591 1.0805 7.8785 6.5146 6.3825 1.0682 1.0644 1.0389 1.0358 1.0349 1.0923 1.0964 1.0948 1.0985 1.1006 1.1008 1.1001 1.1012 1.0894 1.0899 1.0958 1.0961 1.0735
irintensity: 1.0213 0.8220 0.6821 0.7115 0.2406 0.2615 0.7314 0.2559 1.4743 0.5705 1.8544 6.1463 1.7118 5.7050 7.7601 0.2917 8.8026 16.4756 0.9008 10.4590 2.5249 15.8026 0.1350 51.2055 62.3089 15.3437 72.2876 12.6307 21.3178 0.1760 6.0253 28.7014 12.1689 10.0081 11.1625 3.2356 118.1377 24.1021 46.8996 59.6200 62.8033 23.9900 2.9767 1.3543 0.5060 2.5558 1.0885 2.7707 1.0715 20.5446 24.6193 25.6705 8.6432 6.7698 1.1794 11.9726 4.8503 2.4695 0.3062 0.9375 8.6956 2.5517 2.8522 11.2614 0.2880 5.9303 9.9025 21.2833 15.6684 11.3624 16.8302 16.4770 18.7653 4.4784 14.6176 5.1711 7.6304 24.0213 40.8415 5.5938 7.6033 26.7637 31.5987 26.3773 40.7271 28.8140 18.8382 1.4238 18.1908 46.5736 31.2081 20.9591 15.2365 59.4842 14.5639 9.1865 3.6435 5.9241 9.8428
temp: 298.150 k
press: 1.00000 atm
elementType: 16 8 8 7 7 6 6 6 6 6 6 6 6 6 6 6 6 1 1 1 1 1 1 1 1 1 1 1 1 1 1 1 1 1 1
symmnumber: 1
zpe: 733495.8 jmol-1
zpe.correction: 0.279374 hartree
zpe.thermalcorrener: 0.299296 hartree
zpe.thermalcorrenthalpy: 0.300240 hartree
zpe.thermalcorrgfe: 0.227817 hartree
zpe.sumelectzpe: -1124.581829 hartree
zpe.sumelectthermal: -1124.561908 hartree
zpe.sumelectthermalent: -1124.560963 hartree
zpe.sumelectthermalfe: -1124.633387 hartree
dipole: 0.3255 -4.9058 2.9609
dipole: 5.7393
quadrupole: -80.2756 -117.7726 -113.4221
quadrupole: 6.9311 0.1378 7.5187
quadrupole: 23.5478 -13.9491 -9.5987 6.9311 0.1378 7.5187
hfenergy: -1124.8612033 hartree
pointgroup: C01 [X(C12H18N2O2S1)]
dipole: 0.2009155 1.7644381 -1.3946537 debye
polarizability: 239.6207746|-1.7205607|176.5399494|12.4008172|8.9851647|151.2259782 unknown
InChI: InChI=1S/C12H18N2O2S/c1-4-11(5-2)13-14-17(15,16)12-8-6-10(3)7-9-12/h6-9,14H,4-5H2,1-3H3
charge 0 multiplicity 1
35 atoms
S  -0.253905 -1.611868 0.880225
O  -0.484505 -3.137202 0.357719
O  0.025933 -1.274102 2.447128
N  1.208876 -1.013228 -0.262056
N  1.692226 0.207047 0.182616
C  2.930709 0.577645 -0.089854
C  -1.64491 -0.511648 0.279429
C  3.35183 1.952602 0.389333
C  3.910165 -0.275536 -0.88415
C  -2.398521 -0.938676 -0.824979
C  -1.890885 0.682476 0.974301
C  -3.752975 1.110307 -0.587863
C  -3.459661 -0.111125 -1.251626
C  -2.956637 1.492025 0.524418
C  4.385171 1.88939 1.546469
C  3.547141 -0.327864 -2.395163
C  -4.9160 1.97489 -1.038749
H  3.790298 2.518021 -0.458569
H  2.450452 2.494756 0.723717
H  3.931598 -1.312703 -0.482581
H  4.93116 0.125416 -0.757629
H  1.863764 -1.831232 -0.275848
H  -2.170789 -1.888521 -1.319076
H  -1.277156 0.957648 1.837219
H  -4.066948 -0.419225 -2.110485
H  -3.170537 2.433149 1.043936
H  5.303752 1.351307 1.247519
H  4.678438 2.908732 1.855745
H  3.954798 1.372683 2.422005
H  2.522036 -0.711791 -2.541559
H  3.599551 0.678929 -2.846547
H  4.247254 -0.985021 -2.940948
H  -4.734147 3.0426 -0.826207
H  -5.107505 1.866965 -2.120341
H  -5.845575 1.688054 -0.509949
