program: Gaussian 09
title: 000277901
version: EM64L-G09RevD.01
frameworkgroup: C1[X(C11H16N2O2S)]
method: RPBEPBE
basis: SDD
operation: Freq
keyword: #p
keyword: freq=noraman
keyword: PBEPBE/SDD
title: #p freq=noraman PBEPBE/SDD
converged: YES YES NO NO
title: Mulliken charges:
elementType: S O O N N C C C C C C C C C C C H H H H H H H H H H H H H H H H
charge: 0.957800 -0.541592 -0.515777 -0.496742 0.002573 0.195779 -0.470591 -0.493674 -0.012830 -0.674101 -0.671463 -0.249936 -0.239831 -0.202074 -0.205363 -0.216650 0.205283 0.238149 0.208169 0.229298 0.294501 0.208515 0.225165 0.239769 0.248182 0.221669 0.224488 0.284261 0.288359 0.240942 0.240942 0.236778
chargesum: 0.00000
title: Mulliken charges with hydrogens summed into heavy atoms:
elementType: S O O N N C C C C C C C C C C C
charge: 0.957800 -0.541592 -0.515777 -0.202241 0.002573 0.195779 -0.027159 -0.056208 -0.012830 -0.000652 0.022877 0.034326 0.048528 0.038869 0.035578 0.020128
polarizability: 2.16927231e+02 2.26117930e-01 1.64834772e+02 1.10814252e+01 -7.90337086e+00 1.41048209e+02
1716.lowfreq: -2.8124 -0.0024 -0.0009 0.0016 5.7249 10.0293 18.8689 26.9087 31.4663
frequency: 18.2317 26.6169 31.3908 50.8787 75.0549 97.7387 109.3261 143.9620 150.5694 168.4702 197.6082 209.8167 232.7655 245.2254 248.9768 263.6055 342.1926 351.3917 375.9661 404.2801 413.0284 425.8435 468.7662 501.6976 543.1080 602.6166 655.9382 657.2205 689.7323 707.2589 761.7108 776.3868 786.3628 808.6650 847.0027 850.1486 934.6618 940.8114 948.8758 956.7778 979.1977 983.9349 1004.9524 1008.4580 1009.7300 1036.2926 1041.8234 1051.3669 1074.8655 1078.1917 1126.6459 1173.2754 1178.1247 1217.8363 1250.5338 1266.9055 1287.4050 1304.5653 1309.1985 1335.3259 1384.8636 1387.8153 1393.9834 1438.0336 1453.3212 1458.1349 1474.8614 1477.3331 1478.5189 1485.1647 1493.1402 1578.7961 1581.9491 1604.8795 2947.3466 2975.1243 2983.0111 2987.6851 3048.8139 3060.2772 3081.9870 3087.0204 3090.5888 3092.8987 3137.7142 3149.8930 3159.8186 3169.5094 3177.3816 3202.0865
redmass: 4.1045 3.7802 4.1701 3.5158 3.0852 3.3947 4.0419 5.5553 3.8740 4.3438 2.0378 1.3659 2.0869 4.2765 2.5905 3.6162 5.0655 3.3077 6.1722 2.8141 3.7922 4.2601 5.4116 4.0972 2.6373 6.4773 3.6994 6.2330 2.3038 3.3270 1.4530 1.2427 1.2799 9.2229 1.7801 1.2563 1.3820 2.4783 4.3392 2.6373 5.7718 1.3968 1.3438 3.1239 3.3425 1.5221 1.8986 2.1771 1.8087 1.5509 1.9413 1.0558 1.1229 1.6332 1.1906 1.3436 1.2360 1.2962 1.3881 2.0600 8.4506 1.1954 1.2073 2.2666 2.0388 1.0822 1.0472 1.0451 1.0583 1.0606 1.0812 5.9376 7.7498 6.9828 1.0684 1.0644 1.0360 1.0348 1.0923 1.0965 1.0986 1.1007 1.1008 1.1013 1.0859 1.0889 1.0932 1.0969 1.1009 1.0735
irintensity: 1.1873 0.7025 0.8897 0.4475 0.3120 0.1856 0.4606 2.7929 0.5632 2.5900 8.2865 3.5949 6.2165 3.3929 2.2136 6.7990 10.0478 8.5818 23.6742 0.0046 26.8032 76.2942 17.1728 75.1146 12.1119 0.0422 5.5767 2.9545 33.4954 39.1726 65.9035 15.5931 2.8909 96.9191 92.7688 2.7782 2.4296 61.9398 28.0648 3.7450 1.1414 0.0350 0.1630 1.3670 2.5397 0.6114 19.3853 24.3826 8.3628 4.3003 0.6950 0.0050 7.6527 1.0431 0.2204 0.8542 7.8123 3.2975 2.6553 11.0654 6.0284 4.3647 22.2533 16.4105 13.2908 12.2018 4.6209 13.8624 5.3186 7.3353 23.9450 8.5402 36.7889 0.2055 26.8217 31.8028 40.3865 28.3682 17.9900 1.5621 46.7407 30.7382 20.1541 59.1673 1.2690 12.4502 3.8719 4.3685 24.4129 10.1510
temp: 298.150 k
press: 1.00000 atm
elementType: 16 8 8 7 7 6 6 6 6 6 6 6 6 6 6 6 1 1 1 1 1 1 1 1 1 1 1 1 1 1 1 1
symmnumber: 1
zpe: 662619.1 jmol-1
zpe.correction: 0.252378 hartree
zpe.thermalcorrener: 0.270392 hartree
zpe.thermalcorrenthalpy: 0.271336 hartree
zpe.thermalcorrgfe: 0.203908 hartree
zpe.sumelectzpe: -1085.351610 hartree
zpe.sumelectthermal: -1085.333596 hartree
zpe.sumelectthermalent: -1085.332652 hartree
zpe.sumelectthermalfe: -1085.400080 hartree
dipole: -1.7377 3.5257 3.8598
dipole: 5.5089
quadrupole: -81.2295 -104.7029 -109.5544
quadrupole: 10.2649 5.1228 -6.3726
quadrupole: 17.2661 -6.2073 -11.0588 10.2649 5.1228 -6.3726
hfenergy: -1085.6039879 hartree
pointgroup: C01 [X(C11H16N2O2S1)]
dipole: 0.730099 1.3044677 -1.5693567 debye
polarizability: 215.8929284|0.8539506|165.7022264|14.0502807|6.6404706|141.2150577 unknown
InChI: InChI=1S/C11H16N2O2S/c1-3-10(4-2)12-13-16(14,15)11-8-6-5-7-9-11/h5-9,13H,3-4H2,1-2H3
charge 0 multiplicity 1
32 atoms
S  -0.799508 -1.247157 1.005088
O  -1.190682 -2.803246 0.724581
O  -0.569819 -0.675623 2.510966
N  0.780894 -1.023761 -0.113168
N  1.400337 0.184236 0.166916
C  2.685727 0.353099 -0.087428
C  3.263559 1.724211 0.201415
C  3.574658 -0.726373 -0.689223
C  -2.009577 -0.113437 0.121041
C  4.225636 1.719279 1.420393
C  3.266542 -0.960312 -2.195424
C  -2.73142 -0.641926 -0.960962
C  -2.152399 1.196499 0.604119
C  -3.657221 0.211763 -1.603664
C  -3.08267 2.033459 -0.054889
C  -3.827075 1.54314 -1.153771
H  3.81154 2.086525 -0.692503
H  2.42883 2.421414 0.38909
H  3.444071 -1.685601 -0.141483
H  4.633686 -0.440557 -0.563604
H  1.321891 -1.907297 0.044932
H  5.07581 1.028748 1.269566
H  4.638995 2.730192 1.587322
H  3.690135 1.409325 2.334666
H  2.207396 -1.236271 -2.342644
H  3.463931 -0.045793 -2.782581
H  3.898178 -1.770826 -2.600272
H  -2.586282 -1.681258 -1.272395
H  -1.569991 1.536467 1.465697
H  -4.24325 -0.163666 -2.448871
H  -3.223736 3.062859 0.290374
H  -4.546786 2.19789 -1.65708
