program: Gaussian 09
title: 000277904
version: EM64L-G09RevD.01
frameworkgroup: C1[X(C11H16N2O2S)]
method: RPBEPBE
basis: SDD
operation: Freq
keyword: #p
keyword: freq=noraman
keyword: PBEPBE/SDD
title: #p freq=noraman PBEPBE/SDD
converged: YES YES NO NO
title: Mulliken charges:
elementType: S O O N N C C C C C C C C C C C H H H H H H H H H H H H H H H H
charge: 0.957565 -0.515985 -0.542635 -0.503492 0.023490 -0.143309 0.152732 -0.688245 -0.680692 -0.014234 -0.797596 -0.251303 -0.233724 -0.202437 -0.206404 -0.217000 0.212179 0.223411 0.201970 0.229997 0.216153 0.231013 0.220764 0.246230 0.233960 0.254811 0.302852 0.285060 0.285235 0.241183 0.241571 0.236881
chargesum: 0.00000
title: Mulliken charges with hydrogens summed into heavy atoms:
elementType: S O O N N C C C C C C C C C C C
charge: 0.957565 -0.515985 -0.542635 -0.200640 0.023490 0.068870 0.152732 -0.032866 -0.012762 -0.014234 -0.062595 0.033757 0.051511 0.038745 0.035167 0.019881
polarizability: 2.17636299e+02 -3.67792011e+00 1.68360497e+02 8.82245442e+00 9.65251814e+00 1.33014889e+02
1716.lowfreq: -7.2515 -3.0744 -0.0020 -0.0014 0.0017 7.0951 16.1489 27.7567 32.6145
frequency: 15.9141 27.4018 32.5773 59.0973 71.3725 110.1608 136.2849 143.5689 159.2371 172.2694 185.0471 202.5221 237.1479 243.5003 252.5924 298.0937 316.3220 345.1324 379.4626 391.9204 404.1294 414.4838 428.5229 484.0172 503.5899 535.7431 602.3578 604.5088 656.1541 690.1646 696.3093 761.3858 806.6507 822.9334 850.4611 886.1649 923.4317 935.2838 947.6189 955.3502 958.0352 978.7228 983.9650 1002.2435 1004.6162 1008.9007 1033.9518 1050.8609 1078.0135 1094.3368 1129.2334 1155.6481 1173.1518 1178.0076 1232.4280 1283.1587 1291.8300 1304.3841 1342.2784 1378.6129 1384.3997 1388.2462 1398.7550 1437.9216 1452.6322 1460.3410 1462.1695 1467.3211 1468.7902 1481.8058 1488.9348 1578.1798 1591.4493 1604.9609 2950.2201 2956.8445 2979.3351 2988.8376 3032.0085 3075.7310 3082.0761 3086.0474 3095.4137 3103.3572 3137.1453 3149.6151 3159.2841 3169.1865 3176.9193 3222.6967
redmass: 4.5690 3.3722 3.3955 3.7813 4.1725 4.8868 1.3565 6.6383 3.4635 5.3698 3.3333 1.0410 1.4292 4.6316 2.6752 2.9658 3.9182 3.4073 6.9721 3.9114 2.8194 4.3274 5.4799 3.3284 4.1362 3.2006 6.4624 2.5545 6.2703 2.3241 3.0451 1.4502 5.2785 2.7189 1.2441 2.5236 1.1537 1.3751 5.3834 1.9627 1.6502 5.8173 1.3986 1.4337 1.3396 4.0005 2.5138 2.1903 1.5540 1.8801 2.4035 2.0558 1.0562 1.1234 1.8196 1.3241 1.2526 1.2954 2.0246 1.2193 8.2496 1.2023 1.2037 2.2681 2.0337 1.0461 1.0604 1.0495 1.0562 1.0468 1.0745 5.8448 8.3631 6.9915 1.0818 1.0420 1.0345 1.0358 1.0937 1.0997 1.1009 1.1000 1.0996 1.0970 1.0859 1.0889 1.0932 1.0969 1.1009 1.0739
irintensity: 1.4300 0.6985 0.4769 0.6813 0.7324 0.6946 2.0752 1.5192 1.1300 3.7598 12.4717 0.4447 1.6101 7.7873 1.5336 1.1505 9.3752 11.8279 18.0426 20.2694 0.0397 19.8347 71.2249 30.1243 55.2853 0.0646 0.0068 22.8264 1.8064 30.3881 45.3228 67.0825 109.4464 72.2564 0.1921 23.5164 4.1517 1.6660 60.8029 6.4855 6.6876 0.7808 0.0968 1.4905 0.1058 1.0595 3.2090 22.2591 3.3102 33.8609 2.5802 8.7044 0.0443 6.7738 7.3760 0.9083 7.4536 3.2819 3.0511 11.2084 5.4304 42.4639 11.5176 16.1883 14.2526 14.1643 9.4485 0.6153 21.8538 24.2253 15.2456 3.4118 35.3679 0.2356 27.4392 15.5938 40.4321 23.2787 16.1754 30.0246 8.1667 71.6301 32.1517 22.7244 1.3892 12.0966 3.5980 4.6006 23.7283 10.2083
temp: 298.150 k
press: 1.00000 atm
elementType: 16 8 8 7 7 6 6 6 6 6 6 6 6 6 6 6 1 1 1 1 1 1 1 1 1 1 1 1 1 1 1 1
symmnumber: 1
zpe: 660230.3 jmol-1
zpe.correction: 0.251468 hartree
zpe.thermalcorrener: 0.269639 hartree
zpe.thermalcorrenthalpy: 0.270583 hartree
zpe.thermalcorrgfe: 0.203185 hartree
zpe.sumelectzpe: -1085.353538 hartree
zpe.sumelectthermal: -1085.335368 hartree
zpe.sumelectthermalent: -1085.334424 hartree
zpe.sumelectthermalfe: -1085.401822 hartree
dipole: 1.6835 3.7091 -3.6040
dipole: 5.4388
quadrupole: -83.2417 -105.4452 -107.8562
quadrupole: -12.6110 2.0507 7.1352
quadrupole: 15.6060 -6.5975 -9.0085 -12.6110 2.0507 7.1352
hfenergy: -1085.6050064 hartree
pointgroup: C01 [X(C11H16N2O2S1)]
dipole: -0.7029487 1.5439574 1.3041508 debye
polarizability: 217.3741561|5.6520229|166.9738764|8.845503|-11.9659726|134.663652 unknown
InChI: InChI=1S/C11H16N2O2S/c1-9(2)10(3)12-13-16(14,15)11-7-5-4-6-8-11/h4-9,13H,1-3H3
charge 0 multiplicity 1
32 atoms
S  0.880752 -1.490416 -0.541352
O  0.40173 -1.34137 -2.088622
O  1.534725 -2.866985 0.032339
N  -0.58477 -1.18743 0.70513
N  -1.419426 -0.19256 0.226973
C  -3.519316 1.052847 0.164828
C  -2.645771 -0.079794 0.694313
C  -2.736738 2.087936 -0.669082
C  -4.703354 0.461984 -0.657242
C  1.995129 -0.033335 -0.126292
C  -3.212932 -1.024679 1.7407
C  2.921455 -0.194949 0.915791
C  1.864905 1.131995 -0.897508
C  3.773241 0.896592 1.202653
C  2.724978 2.212312 -0.591194
C  3.670879 2.093887 0.454481
H  -3.95398 1.564694 1.051329
H  -1.913985 2.533051 -0.083188
H  -3.413796 2.895657 -1.00291
H  -2.289444 1.611441 -1.558623
H  -5.284455 -0.280539 -0.080195
H  -4.322907 -0.031472 -1.569934
H  -5.393536 1.269194 -0.962868
H  -4.214251 -0.705371 2.069762
H  -3.303081 -2.061797 1.354223
H  -2.547895 -1.066415 2.625367
H  -0.985132 -2.143233 0.851059
H  2.982448 -1.140673 1.463604
H  1.132203 1.181407 -1.708624
H  4.513592 0.809528 2.00457
H  2.655368 3.139834 -1.168796
H  4.335066 2.934461 0.683204
