program: Gaussian 09
title: 000277892
version: EM64L-G09RevD.01
frameworkgroup: C1[X(C10H14N2O2S)]
method: RPBEPBE
basis: SDD
operation: Freq
keyword: #p
keyword: freq=noraman
keyword: PBEPBE/SDD
title: #p freq=noraman PBEPBE/SDD
converged: YES YES NO NO
title: Mulliken charges:
elementType: S O O N N C C C C C C C C C C H H H H H H H H H H H H H H
charge: 0.960397 -0.514151 -0.542010 -0.499411 0.008696 -0.011804 -0.461964 0.179898 -0.239073 -0.250727 -0.669127 -0.783996 -0.205614 -0.202149 -0.216627 0.241203 0.210428 0.301396 0.288801 0.284496 0.224853 0.232757 0.211494 0.232375 0.245740 0.255027 0.241169 0.241089 0.236833
chargesum: 0.00000
title: Mulliken charges with hydrogens summed into heavy atoms:
elementType: S O O N N C C C C C C C C C C
charge: 0.960397 -0.514151 -0.542010 -0.198015 0.008696 -0.011804 -0.010333 0.179898 0.049729 0.033769 -0.000023 -0.050855 0.035555 0.038939 0.020206
polarizability: 1.99065027e+02 5.78499199e+00 1.56496060e+02 -9.77753061e+00 1.12215685e+01 1.31468051e+02
1716.lowfreq: -8.6139 -0.0019 -0.0005 0.0016 2.3520 7.5993 18.8440 29.8568 36.0165
frequency: 18.8133 29.7876 35.9860 68.1685 77.6586 112.3744 130.0049 144.8548 161.0153 184.9078 196.8127 229.5248 244.7568 248.4125 327.3274 358.6665 365.0236 389.1774 403.9076 426.6856 458.4677 499.5211 543.6826 566.9649 602.2221 656.3652 689.6678 718.0624 762.0253 785.1541 808.2240 831.8022 850.5281 933.2447 938.6614 951.3766 977.3111 983.9360 986.0749 996.3861 1005.2253 1008.8461 1009.3189 1050.4985 1069.3543 1078.1659 1117.4250 1173.2389 1178.3500 1240.6335 1277.4855 1290.7892 1304.6106 1324.0717 1384.5507 1384.9017 1390.3167 1437.9377 1453.0573 1456.0064 1464.2343 1465.7445 1478.2633 1486.1019 1578.3881 1588.2282 1605.1241 2955.6417 2978.5133 2983.0012 3031.8193 3061.9494 3083.0193 3090.9490 3106.5098 3137.1216 3149.6795 3159.3386 3169.1906 3176.8934 3221.8879
redmass: 4.5139 3.7862 2.7554 3.0139 6.8116 2.8971 1.2861 7.1061 5.1739 2.8618 2.0645 2.2275 3.1034 7.2558 4.8355 5.6925 2.5100 5.0269 2.8179 5.2647 5.3065 4.0290 3.4607 2.4496 6.4781 6.3981 2.3162 3.1015 1.4485 1.2112 7.2211 2.3731 1.2444 1.6345 1.8124 9.1050 4.8680 1.4559 1.9080 1.5076 1.3396 2.2013 3.5399 2.1821 1.9180 1.5536 1.9764 1.0561 1.1234 1.3856 1.5626 1.3575 1.2953 1.8105 7.5923 1.2472 1.1887 2.2681 2.0316 1.0880 1.0733 1.0532 1.0450 1.0686 5.8441 7.9912 6.9864 1.0425 1.0636 1.0365 1.0932 1.0967 1.0986 1.1013 1.0967 1.0859 1.0889 1.0932 1.0969 1.1009 1.0738
irintensity: 1.4754 0.1401 1.9205 0.6390 0.4824 1.6189 1.7773 1.7126 0.8723 5.8071 2.9315 8.1735 2.8969 4.5437 18.7258 16.4484 6.3567 18.5955 0.0786 91.5832 12.4096 68.9977 3.5113 32.5353 0.0523 1.8761 32.1425 62.1529 64.7991 4.6895 104.9470 81.9765 0.2797 5.8734 9.0821 63.6302 3.8820 2.0387 11.0848 2.0767 0.1908 0.3619 0.9582 23.7843 7.8477 3.6756 6.8786 0.0365 7.0336 4.2083 2.0784 8.2699 3.3812 4.5274 8.7707 24.1040 19.6227 16.4805 13.8954 18.5601 12.5426 10.0708 20.5688 14.2988 3.4918 34.1383 0.2090 13.5537 29.8518 37.1987 18.8710 0.9754 46.3274 37.1537 22.6479 1.4097 12.5774 3.7377 3.8569 24.1109 10.1174
temp: 298.150 k
press: 1.00000 atm
elementType: 16 8 8 7 7 6 6 6 6 6 6 6 6 6 6 1 1 1 1 1 1 1 1 1 1 1 1 1 1
symmnumber: 1
zpe: 587964.1 jmol-1
zpe.correction: 0.223944 hartree
zpe.thermalcorrener: 0.240737 hartree
zpe.thermalcorrenthalpy: 0.241681 hartree
zpe.thermalcorrgfe: 0.177255 hartree
zpe.sumelectzpe: -1046.129727 hartree
zpe.sumelectthermal: -1046.112934 hartree
zpe.sumelectthermalent: -1046.111990 hartree
zpe.sumelectthermalfe: -1046.176416 hartree
dipole: -2.1629 4.5663 -2.3848
dipole: 5.5871
quadrupole: -76.5871 -101.4091 -98.8601
quadrupole: 13.2019 -1.2446 6.1545
quadrupole: 15.6983 -9.1237 -6.5746 13.2019 -1.2446 6.1545
hfenergy: -1046.3536707 hartree
pointgroup: C01 [X(C10H14N2O2S1)]
dipole: -0.7295453 -1.912494 0.8012331 debye
polarizability: 200.0492876|-3.8351757|153.8301215|6.7430068|13.7677581|133.1497283 unknown
InChI: InChI=1S/C10H14N2O2S/c1-3-9(2)11-12-15(13,14)10-7-5-4-6-8-10/h4-8,12H,3H2,1-2H3
charge 0 multiplicity 1
29 atoms
S  0.624573 1.668452 -0.204966
O  0.317561 1.931244 -1.780001
O  1.121204 2.859669 0.787832
N  -0.929475 0.989896 0.737761
N  -1.639296 0.110841 -0.064275
C  1.782149 0.193287 -0.067686
C  -3.597226 -1.178254 -0.660374
C  -2.909014 -0.135958 0.196988
C  1.819884 -0.709788 -1.141198
C  2.571349 0.085089 1.088021
C  -3.945768 -2.470724 0.12526
C  -3.671962 0.53627 1.324945
C  2.711711 -1.802771 -1.038447
C  3.457231 -1.013957 1.16845
C  3.522147 -1.953506 0.11159
H  -2.934293 -1.421791 -1.508378
H  -4.529711 -0.744992 -1.076279
H  -1.410693 1.850675 1.08809
H  1.188039 -0.552672 -2.02053
H  2.506311 0.838623 1.879326
H  -4.467046 -3.190881 -0.530718
H  -3.028182 -2.952335 0.506682
H  -4.606006 -2.260741 0.987002
H  -3.676798 1.640716 1.210005
H  -4.720133 0.200333 1.352825
H  -3.207482 0.316918 2.30621
H  2.77135 -2.531055 -1.853794
H  4.094064 -1.13255 2.051121
H  4.211613 -2.801836 0.18214
