program: Gaussian 09
title: 000277900
version: EM64L-G09RevD.01
frameworkgroup: C1[X(C12H12N2O3S)]
method: RPBEPBE
basis: SDD
operation: Freq
keyword: #p
keyword: freq=noraman
keyword: PBEPBE/SDD
title: #p freq=noraman PBEPBE/SDD
converged: YES YES NO NO
title: Mulliken charges:
elementType: S O O O N N C C C C C C C C C C C C H H H H H H H H H H H H
charge: 0.959012 -0.535281 -0.509754 -0.243531 -0.479635 0.043729 -0.034615 0.451930 -0.236304 -0.235578 -0.359736 -0.363309 -0.798448 0.344407 -0.336921 -0.345279 -0.246586 -0.159024 0.282061 0.285341 0.244256 0.243833 0.297287 0.230485 0.230871 0.244408 0.233271 0.273931 0.256322 0.262858
chargesum: 0.00000
title: Mulliken charges with hydrogens summed into heavy atoms:
elementType: S O O O N N C C C C C C C C C C C C
charge: 0.959012 -0.535281 -0.509754 -0.243531 -0.182348 0.043729 -0.034615 0.451930 0.045757 0.049764 -0.115481 -0.119476 -0.092684 0.344407 -0.103649 -0.071348 0.009735 0.103834
polarizability: 3.04526816e+02 2.59349987e+01 1.97370244e+02 1.06217600e+01 2.24042404e+01 1.32263682e+02
1716.lowfreq: -17.6852 -6.3371 -4.5219 0.0015 0.0017 0.0022 2.1223 11.2807 26.2078
frequency: -14.7727 11.1762 26.0627 26.6710 53.0065 72.5126 115.0391 121.5634 133.3175 162.3651 189.9737 211.9402 227.2784 267.5706 287.8060 310.0259 360.1763 383.6298 387.5021 397.6182 407.3685 464.3279 501.6620 512.4091 583.7605 585.4287 620.8182 646.4049 707.0556 727.4832 729.9071 777.1304 795.8931 815.9135 819.7378 830.1100 849.7901 869.8026 885.4381 910.6346 919.8376 950.0129 965.0234 983.9446 991.0571 992.6722 997.5166 1036.4050 1049.4981 1054.0558 1054.8237 1120.9858 1136.0574 1169.9994 1186.2755 1219.1443 1239.4893 1281.4829 1298.5443 1359.0173 1381.8954 1382.5499 1392.7605 1398.5300 1469.4387 1470.8327 1473.6850 1474.4260 1545.3408 1592.0950 1595.4070 1596.5391 2980.8766 3027.2452 3063.7581 3093.2212 3137.3450 3139.0276 3165.5074 3169.3879 3203.1908 3224.5539 3245.1931 3270.0648
redmass: 1.0297 4.9785 3.9465 4.6303 7.8611 5.1225 4.9215 5.9992 6.9430 8.5398 7.6291 4.0066 7.9596 4.4411 5.2950 4.4178 4.6175 4.5449 6.8007 8.6102 2.8710 5.2331 3.8998 3.3113 3.1032 5.2220 6.9541 4.1992 3.2716 1.2909 2.1118 4.9521 3.6048 5.4427 1.3258 1.4481 1.2455 6.4774 1.3667 1.5707 3.1292 11.4295 1.3134 1.4036 1.4402 3.8340 2.2637 2.8948 1.5985 2.8575 2.5198 1.2902 1.5970 2.4065 1.1404 3.0369 1.5778 1.2571 1.2616 2.4627 2.8102 3.2465 3.0182 1.2193 4.9926 1.1043 1.1408 2.0255 5.5029 7.6182 6.0154 6.9389 1.0390 1.0877 1.0947 1.1001 1.0895 1.0897 1.0957 1.0964 1.0740 1.0915 1.0994 1.1080
irintensity: 0.4752 1.0921 0.1171 0.2049 0.4962 0.8287 3.1407 1.6337 1.9295 14.5654 11.9681 22.4929 12.6715 7.9209 26.2442 0.7649 8.2510 2.7173 10.7800 132.0654 0.4535 9.4819 94.8469 53.8100 7.6257 18.9071 0.1128 1.2101 0.4312 71.2572 198.6268 4.1751 177.7451 111.8098 20.1457 34.0282 0.6046 5.2229 0.2683 19.8057 18.6850 62.9952 1.4742 1.1477 2.7342 4.1345 19.6911 7.2765 28.5594 36.0499 21.0595 7.0962 5.4277 6.4151 13.8980 7.1522 4.5348 5.0495 2.6142 17.4134 5.9102 5.6569 11.1556 16.3778 50.7743 16.2471 13.4228 21.7303 2.3376 24.3140 14.0082 0.3058 23.5573 25.6192 17.1236 14.3890 14.1679 7.5570 1.8147 7.9861 10.6975 6.1411 0.0800 0.0486
temp: 298.150 k
press: 1.00000 atm
elementType: 16 8 8 8 7 7 6 6 6 6 6 6 6 6 6 6 6 6 1 1 1 1 1 1 1 1 1 1 1 1
symmnumber: 1
zpe: 569931.0 jmol-1
zpe.correction: 0.217075 hartree
zpe.thermalcorrener: 0.234329 hartree
zpe.thermalcorrenthalpy: 0.235273 hartree
zpe.thermalcorrgfe: 0.168349 hartree
zpe.sumelectzpe: -1196.171924 hartree
zpe.sumelectthermal: -1196.154670 hartree
zpe.sumelectthermalent: -1196.153726 hartree
zpe.sumelectthermalfe: -1196.220649 hartree
dipole: 0.1482 5.5373 -1.8187
dipole: 5.8302
quadrupole: -87.6968 -113.1746 -114.9868
quadrupole: -10.8493 3.7704 10.9022
quadrupole: 17.5893 -7.8886 -9.7007 -10.8493 3.7704 10.9022
hfenergy: -1196.3889989 hartree
pointgroup: C01 [X(C12H12N2O3S1)]
dipole: 0.2461706 2.2142035 -0.5460465 debye
polarizability: 307.827409|15.3615669|190.1733159|15.360582|26.0102276|136.160017 unknown
InChI: InChI=1S/C12H12N2O3S/c1-10-4-6-12(7-5-10)18(15,16)14-13-9-11-3-2-8-17-11/h2-9,14H,1H3
charge 0 multiplicity 1
30 atoms
S  -1.228446 -1.959448 0.228856
O  -2.029313 -3.127538 -0.57316
O  -0.736051 -2.145032 1.76742
O  4.820744 -0.279388 -0.745472
N  0.276299 -1.638022 -0.977192
N  1.23345 -0.844177 -0.414698
C  -2.146359 -0.332792 0.090227
C  -3.548764 2.079513 -0.09131
C  -3.024709 -0.158255 -0.990507
C  -1.934484 0.631546 1.08701
C  -3.72561 1.064372 -1.069747
C  -2.648431 1.845352 0.981704
C  -4.331401 3.376723 -0.1756
C  3.503569 -0.071547 -0.259347
C  2.498867 -0.961692 -0.786944
C  3.515096 0.985124 0.653527
C  4.874794 1.451842 0.747807
C  5.636305 0.667556 -0.108511
H  -3.163204 -0.951997 -1.731282
H  -1.247571 0.432362 1.915221
H  -4.41828 1.230933 -1.902548
H  -2.502107 2.620364 1.742682
H  0.540145 -2.582508 -1.345974
H  -3.780131 4.214646 0.284801
H  -4.557722 3.647235 -1.221398
H  -5.297945 3.286737 0.357036
H  2.844549 -1.707263 -1.526492
H  2.643834 1.363565 1.182536
H  5.244564 2.263924 1.370533
H  6.689213 0.636668 -0.373774
