program: Gaussian 09
title: 000277902
version: EM64L-G09RevD.01
frameworkgroup: C1[X(C12H18N2O2S)]
method: RPBEPBE
basis: SDD
operation: Freq
keyword: #p
keyword: freq=noraman
keyword: PBEPBE/SDD
title: #p freq=noraman PBEPBE/SDD
converged: NO YES NO NO
title: Mulliken charges:
elementType: S O O N N C C C C C C C C C C C C H H H H H H H H H H H H H H H H H H
charge: 0.956496 -0.516781 -0.541715 0.030720 -0.499864 0.194099 0.101863 -0.692672 -0.703392 -0.691980 -0.789302 -0.014585 -0.232539 -0.251719 -0.207459 -0.202561 -0.217202 0.206306 0.230747 0.217229 0.197683 0.222798 0.232794 0.217190 0.226923 0.205777 0.242587 0.255109 0.232184 0.301149 0.285194 0.285124 0.241624 0.241287 0.236887
chargesum: 0.00000
title: Mulliken charges with hydrogens summed into heavy atoms:
elementType: S O O N N C C C C C C C C C C C C
charge: 0.956496 -0.516781 -0.541715 0.030720 -0.198715 0.194099 0.101863 -0.038390 -0.050118 -0.042090 -0.059422 -0.014585 0.052655 0.033405 0.034165 0.038726 0.019685
polarizability: 2.26312415e+02 5.52346077e+00 1.79137259e+02 -1.04813192e+01 9.42968278e+00 1.46852881e+02
1716.lowfreq: -11.9153 -3.6340 -0.0011 -0.0002 0.0020 5.5339 16.0853 23.6514 29.1587
frequency: 15.5378 23.1015 29.1415 54.4499 68.8521 111.0618 112.7484 143.8130 154.7465 162.6539 176.9717 198.7707 238.4778 242.9391 247.8992 270.1239 273.0357 319.9508 337.4502 345.3284 358.7522 384.5662 392.5445 404.9949 423.6221 440.8175 493.5088 501.9989 548.4019 572.7491 602.3332 654.1411 665.8571 690.4021 761.6963 795.8593 810.1007 845.4786 851.5573 920.1478 932.6701 935.4096 943.4571 947.0371 951.2454 978.8048 984.7054 998.1901 1004.6086 1006.8619 1009.6216 1030.5262 1049.8775 1054.8846 1078.8902 1147.8736 1173.2963 1179.1561 1202.7325 1224.6499 1279.8614 1303.9900 1305.3586 1371.2582 1376.6224 1384.9368 1386.7973 1406.0115 1437.1540 1450.7303 1453.9440 1460.1074 1463.1963 1464.4490 1468.3322 1480.7930 1483.0191 1497.1268 1573.9924 1578.8748 1605.1640 2956.7388 2974.8198 2977.6858 2987.3261 3030.6478 3069.9952 3073.9606 3077.3838 3080.8572 3085.1846 3096.9590 3116.9881 3137.3365 3149.3940 3159.3460 3168.9536 3176.7688 3222.4354
redmass: 4.2109 3.2257 3.8355 4.0113 4.8217 2.4433 1.6444 6.8659 3.9037 1.4535 5.4241 2.2437 1.1298 2.6238 2.6966 2.0941 1.5133 4.4623 3.0742 2.8531 3.3288 4.1360 4.0724 2.8209 4.5258 4.2707 4.1364 4.0165 2.6649 3.1662 6.4755 4.7089 3.6609 2.3241 1.4459 2.5129 10.1304 2.2192 1.2518 1.7257 1.6323 1.4134 3.1532 1.2250 3.5126 5.9563 1.3958 1.4396 1.3663 1.7943 3.4696 1.5388 2.1086 2.1536 1.5585 2.3907 1.0558 1.1244 2.8269 3.2289 1.4440 2.4443 1.2951 1.1845 1.2206 8.1609 1.1969 1.2025 2.2610 1.0491 2.0261 1.0649 1.0488 1.0487 1.0510 1.0506 1.0567 1.0863 9.3173 5.8607 6.9543 1.0434 1.0344 1.0348 1.0361 1.0930 1.0998 1.0994 1.1009 1.0998 1.0992 1.0995 1.0949 1.0859 1.0889 1.0932 1.0969 1.1010 1.0738
irintensity: 1.3193 0.7876 0.1853 0.6944 1.0872 1.2650 1.8739 1.2727 1.3447 0.9502 7.5669 6.8429 0.7502 6.8354 2.1642 2.2228 0.4829 8.9133 9.7227 3.7448 16.7522 8.8155 19.7473 0.0944 70.8683 13.0280 10.9669 70.4755 7.9319 3.8283 0.0470 8.3805 45.7542 35.7984 67.9638 67.7911 82.6785 57.4467 1.6366 1.5760 4.2621 1.8771 48.6222 1.2482 25.5876 0.9820 0.0859 1.4300 0.2943 1.8703 0.8477 1.7124 22.5792 3.8437 3.2062 52.0004 0.0857 6.3910 7.2395 4.1730 5.8665 7.3207 3.3293 22.5026 8.8170 4.3972 47.0123 5.5194 16.3616 3.8445 13.9143 8.2441 0.2244 5.3911 0.8236 24.8753 31.0037 26.1504 38.0558 0.8698 0.2059 14.1439 29.6464 41.6869 23.5223 15.7766 3.8664 38.9723 10.7950 27.4050 89.7634 28.8715 24.3145 1.2594 12.0717 3.4134 4.4042 23.9019 11.1848
temp: 298.150 k
press: 1.00000 atm
elementType: 16 8 8 7 7 6 6 6 6 6 6 6 6 6 6 6 6 1 1 1 1 1 1 1 1 1 1 1 1 1 1 1 1 1 1
symmnumber: 1
zpe: 731250.8 jmol-1
zpe.correction: 0.278519 hartree
zpe.thermalcorrener: 0.298129 hartree
zpe.thermalcorrenthalpy: 0.299073 hartree
zpe.thermalcorrgfe: 0.228670 hartree
zpe.sumelectzpe: -1124.577023 hartree
zpe.sumelectthermal: -1124.557412 hartree
zpe.sumelectthermalent: -1124.556468 hartree
zpe.sumelectthermalfe: -1124.626871 hartree
dipole: -2.2711 4.0429 -2.9880
dipole: 5.5164
quadrupole: -94.2618 -111.6852 -113.2654
quadrupole: 16.1978 -3.3246 6.9685
quadrupole: 12.1423 -5.2811 -6.8613 16.1978 -3.3246 6.9685
hfenergy: -1124.8555412 hartree
pointgroup: C01 [X(C12H18N2O2S1)]
dipole: 0.9044164 1.6735626 1.0447728 debye
polarizability: 226.3775161|-6.9957027|177.4528211|-9.0375323|-12.0476135|148.4722185 unknown
InChI: InChI=1S/C12H18N2O2S/c1-10(12(2,3)4)13-14-17(15,16)11-8-6-5-7-9-11/h5-9,14H,1-4H3
charge 0 multiplicity 1
35 atoms
S  -1.260708 -1.607639 -0.352438
O  -0.83067 -1.709961 -1.918411
O  -2.017555 -2.828785 0.414263
N  1.155081 -0.41624 0.182534
N  0.274608 -1.288221 0.801292
C  3.327904 0.673346 -0.105659
C  2.413662 -0.359645 0.571973
C  4.524328 -0.073127 -0.771801
C  2.564916 1.470747 -1.192477
C  3.867006 1.665464 0.969271
C  2.952112 -1.261669 1.670564
C  -2.214279 -0.006078 -0.105189
C  -2.00457 1.031091 -1.027191
C  -3.109813 0.061983 0.973641
C  -2.743314 2.222893 -0.84263
C  -3.840282 1.26153 1.137196
C  -3.653062 2.336168 0.235119
H  5.123172 -0.643873 -0.038789
H  4.167077 -0.774009 -1.547849
H  5.196065 0.66018 -1.255086
H  3.251598 2.193958 -1.670818
H  1.715271 2.0237 -0.756428
H  2.159137 0.798935 -1.968065
H  4.531394 2.408168 0.489938
H  3.035271 2.20947 1.452365
H  4.449833 1.15361 1.75681
H  4.008675 -1.0555 1.894782
H  2.364577 -1.132382 2.600491
H  2.876091 -2.332516 1.386099
H  0.612059 -2.248866 1.042888
H  -1.304309 0.901957 -1.858034
H  -3.239444 -0.794239 1.643212
H  -2.608301 3.05657 -1.539417
H  -4.55251 1.353281 1.963657
H  -4.22322 3.261896 0.368987
