program: Gaussian 09
title: 000277907
version: EM64L-G09RevD.01
frameworkgroup: C1[X(C14H20N2O2S)]
method: RPBEPBE
basis: SDD
operation: Freq
keyword: #p
keyword: freq=noraman
keyword: PBEPBE/SDD
title: #p freq=noraman PBEPBE/SDD
converged: YES YES NO NO
title: Mulliken charges:
elementType: S O O N N C C C C C C C C C C C C C C H H H H H H H H H H H H H H H H H H H H
charge: 0.959176 -0.546123 -0.515573 -0.011142 -0.503343 -0.393898 -0.370478 -0.384835 -0.374777 -0.487863 -0.513574 0.177809 -0.035659 -0.232897 -0.240873 0.452972 -0.366278 -0.362767 -0.800297 0.190852 0.204484 0.193267 0.195674 0.205108 0.210832 0.199591 0.196980 0.198138 0.237711 0.238370 0.219778 0.303792 0.286169 0.282188 0.242599 0.242384 0.230386 0.241682 0.230436
chargesum: 0.00000
title: Mulliken charges with hydrogens summed into heavy atoms:
elementType: S O O N N C C C C C C C C C C C C C C
charge: 0.959176 -0.546123 -0.515573 -0.011142 -0.199552 0.001438 0.018463 0.031106 0.021794 -0.052015 -0.055426 0.177809 -0.035659 0.053272 0.041315 0.452972 -0.123679 -0.120383 -0.097793
polarizability: 2.57769999e+02 1.09841844e+01 1.96063435e+02 -9.43739741e+00 1.10909144e+01 1.71062165e+02
1716.lowfreq: -8.4610 0.0010 0.0014 0.0024 2.8871 7.9966 15.1936 22.1413 27.8399
frequency: 14.9777 21.2504 27.6036 30.0155 54.3066 72.3006 95.6711 113.3659 129.9539 142.9490 183.4857 198.7475 223.7308 235.8107 278.1459 289.7432 312.5545 317.2750 327.9796 364.0963 382.9698 391.6605 407.2129 424.1077 427.1551 466.8157 484.4599 511.8526 537.1989 575.9486 586.0547 621.7168 680.2757 709.7732 770.0988 776.6073 801.8845 807.8018 826.6331 829.9396 847.0490 849.5255 860.7706 896.3209 942.4664 950.5836 964.4153 971.7073 983.3682 990.3543 991.0284 996.5866 1024.5335 1049.4873 1055.7808 1057.4759 1077.2809 1119.0725 1130.6475 1147.2918 1184.6468 1191.3774 1197.9498 1218.2313 1222.5174 1266.0044 1271.6208 1287.8845 1295.9627 1297.0076 1328.6602 1339.3210 1346.7971 1350.5334 1353.9764 1361.4310 1382.2558 1392.3213 1398.4777 1442.3409 1454.0825 1460.3930 1463.9333 1470.4224 1471.2440 1473.5099 1474.2017 1477.4795 1568.6090 1595.9390 1596.7049 2910.4105 2958.4046 2962.8508 2965.4720 2970.7181 2975.1550 2979.8468 2981.2401 3017.3455 3024.7970 3033.0425 3038.1942 3062.4934 3064.8261 3092.1017 3135.4886 3137.5186 3164.0305 3169.5831 3217.1792
redmass: 4.5521 3.3918 1.1741 2.5051 3.6088 6.8374 4.6633 4.2304 6.5688 3.0676 4.5691 4.6567 6.7240 2.6803 5.2701 4.1168 2.9551 2.2685 2.7524 3.0280 3.4296 8.8115 2.8655 4.6101 4.6832 1.8421 2.2886 3.0025 2.6133 2.7654 5.5536 6.9533 2.9851 3.2669 2.5962 4.6370 1.5840 6.8741 1.7468 1.6141 1.6566 1.2482 2.2342 2.1239 2.8816 5.3174 1.3408 1.8803 1.3859 1.4539 2.2756 4.1856 2.3311 1.5907 2.4869 1.6492 1.9345 1.2864 1.9810 1.4073 1.1445 1.2341 1.3662 3.0030 1.4598 1.2322 1.2212 1.2043 1.4658 1.2619 1.5337 1.5175 1.5616 1.5941 1.3613 1.4375 6.6976 2.8877 1.2204 1.0864 1.1072 1.0863 1.0851 1.0900 1.1017 1.9833 1.1578 1.0823 8.6603 6.4573 6.5242 1.0644 1.0612 1.0875 1.0635 1.0661 1.0617 1.0390 1.0667 1.0968 1.0998 1.1012 1.1020 1.0946 1.0953 1.1000 1.0894 1.0898 1.0957 1.0961 1.0736
irintensity: 1.0735 0.5945 0.6174 0.0191 1.1044 0.5896 1.6471 0.3360 0.6889 4.6644 0.0502 3.6490 13.6407 2.3600 23.4923 0.6835 1.3155 2.7529 0.6623 21.4455 7.5268 19.6452 0.1913 83.9912 10.3370 3.1070 0.6616 73.7663 3.5930 35.0508 28.4931 0.1851 19.0785 1.4497 31.1949 12.4726 1.1771 108.9641 53.6632 41.9371 17.2865 0.4154 14.0172 23.4013 49.4721 34.8623 1.8943 3.0959 0.0511 2.8585 0.2457 2.3293 3.7353 17.5125 26.6038 2.9660 0.6480 7.3661 0.5574 3.2728 12.9195 3.2867 0.8729 5.7071 6.9761 0.8201 4.0448 7.2198 3.9862 2.1690 3.3296 1.5034 2.9010 2.4871 3.7669 2.8096 0.5460 10.4585 15.7892 8.1340 23.5069 5.0747 6.4482 9.0310 16.3911 25.0225 11.4008 19.9170 40.1660 6.1356 5.7767 24.4493 33.2956 7.4972 29.5446 15.0302 25.0043 26.3066 46.6713 65.7720 56.7387 25.3965 111.5461 20.9255 16.0522 14.8607 15.0087 8.5552 3.2649 6.6764 11.5772
temp: 298.150 k
press: 1.00000 atm
elementType: 16 8 8 7 7 6 6 6 6 6 6 6 6 6 6 6 6 6 6 1 1 1 1 1 1 1 1 1 1 1 1 1 1 1 1 1 1 1 1
symmnumber: 1
zpe: 830545.8 jmol-1
zpe.correction: 0.316338 hartree
zpe.thermalcorrener: 0.336416 hartree
zpe.thermalcorrenthalpy: 0.337360 hartree
zpe.thermalcorrgfe: 0.264325 hartree
zpe.sumelectzpe: -1201.851801 hartree
zpe.sumelectthermal: -1201.831723 hartree
zpe.sumelectthermalent: -1201.830779 hartree
zpe.sumelectthermalfe: -1201.903814 hartree
dipole: -2.0682 5.6103 -1.9310
dipole: 6.2835
quadrupole: -97.9193 -129.6799 -121.9310
quadrupole: 18.4216 -2.2379 5.1572
quadrupole: 18.5908 -13.1698 -5.4209 18.4216 -2.2379 5.1572
hfenergy: -1202.1681393 hartree
pointgroup: C01 [X(C14H20N2O2S1)]
dipole: 0.6316432 -2.3619046 0.365728 debye
polarizability: 259.4183587|5.4306337|178.6523583|-4.8853327|-17.1632531|186.8248817 unknown
InChI: InChI=1S/C14H20N2O2S/c1-12-8-10-14(11-9-12)19(17,18)16-15-13-6-4-2-3-5-7-13/h8-11,16H,2-7H2,1H3
charge 0 multiplicity 1
39 atoms
S  -1.251576 1.924188 -0.820526
O  -1.722417 2.41058 -2.303206
O  -0.952706 2.979633 0.38057
N  1.056633 0.579018 -0.117039
N  0.309224 0.838941 -1.253388
C  4.660748 -2.088328 0.431611
C  4.565227 -1.958094 -1.107453
C  3.408044 -1.642659 1.220332
C  4.418754 -0.505725 -1.631263
C  3.030188 -0.140749 1.057221
C  2.97755 0.048766 -1.60001
C  2.313851 0.187393 -0.235601
C  -2.432594 0.61931 -0.176682
C  -2.510847 0.421064 1.210194
C  -3.213248 -0.082066 -1.108647
C  -4.236113 -1.291577 0.78333
C  -3.426391 -0.546122 1.680742
C  -4.121841 -1.040784 -0.610592
C  -5.195626 -2.347279 1.301539
H  5.532762 -1.49747 0.783273
H  4.879565 -3.145249 0.685428
H  3.717606 -2.568522 -1.483027
H  5.48253 -2.399283 -1.545539
H  3.590208 -1.829902 2.297048
H  2.537287 -2.266727 0.936511
H  4.759312 -0.469027 -2.684681
H  5.098469 0.161734 -1.064414
H  3.953862 0.468918 1.140153
H  2.359951 0.164532 1.879784
H  2.325929 -0.595216 -2.23095
H  2.967861 1.046726 -2.098607
H  0.758411 1.376174 -2.031606
H  -1.893261 1.015326 1.890496
H  -3.12766 0.133332 -2.178455
H  -3.513486 -0.721374 2.759156
H  -4.752002 -1.598149 -1.313113
H  -6.075651 -2.453962 0.643868
H  -4.700995 -3.33674 1.351555
H  -5.552956 -2.107533 2.317891
