program: Gaussian 09
title: 000277898
version: EM64L-G09RevD.01
frameworkgroup: C1[X(C12H16N2O2S)]
method: RPBEPBE
basis: SDD
operation: Freq
keyword: #p
keyword: freq=noraman
keyword: PBEPBE/SDD
title: #p freq=noraman PBEPBE/SDD
converged: YES YES NO NO
title: Mulliken charges:
elementType: S O O N N C C C C C C C C C C C C H H H H H H H H H H H H H H H H
charge: 0.950617 -0.521120 -0.544027 -0.034191 -0.480375 -0.296849 -0.477714 -0.470626 0.224447 -0.777665 -0.039904 -0.239473 -0.233190 0.452984 -0.359927 -0.369264 -0.800082 0.237235 0.239194 0.269106 0.259930 0.236759 0.241356 0.229451 0.255000 0.292685 0.281769 0.284935 0.242682 0.243094 0.230271 0.242112 0.230779
chargesum: 0.00000
title: Mulliken charges with hydrogens summed into heavy atoms:
elementType: S O O N N C C C C C C C C C C C C
charge: 0.950617 -0.521120 -0.544027 -0.034191 -0.187690 -0.059614 0.030586 0.026064 0.224447 -0.051858 -0.039904 0.042295 0.051745 0.452984 -0.117245 -0.126170 -0.096920
polarizability: 2.36554510e+02 6.57375285e-01 1.86219199e+02 6.74016407e+00 1.31205227e+01 1.41815560e+02
1716.lowfreq: -16.7827 -8.4119 -0.0014 -0.0013 0.0010 0.4489 13.9093 26.4377 28.6544
frequency: 12.1629 26.2776 28.4985 37.9071 44.5860 61.0297 84.8155 119.4574 127.8622 135.3829 161.7211 168.6315 220.9933 235.0188 270.3845 283.8605 314.5506 344.9085 379.3209 391.3577 399.1576 407.8820 418.6580 473.7799 511.8772 549.6552 585.1636 606.7452 620.8168 699.7877 709.4082 775.3761 783.9294 788.5793 806.0145 828.5942 836.8980 849.9606 863.3247 893.7314 944.6577 962.4979 967.2179 983.7609 990.1066 995.8668 1022.1062 1035.5319 1047.6232 1049.7120 1054.2882 1077.1579 1090.8389 1101.9005 1119.2443 1178.2593 1185.1018 1190.9540 1217.6873 1237.0269 1290.8623 1296.9010 1381.6072 1387.4743 1391.6471 1397.9079 1400.0242 1425.1245 1448.0271 1463.6389 1470.2404 1471.3917 1473.1257 1474.9866 1570.0653 1595.5765 1596.0413 2955.1388 2980.5867 3032.2849 3063.2137 3093.2165 3095.2588 3101.6955 3107.9272 3135.5395 3137.8316 3144.9946 3163.8506 3168.3641 3183.4638 3201.9461 3220.7296
redmass: 4.8394 3.2645 3.1191 1.0748 3.1627 4.6018 3.9103 1.2808 5.2597 3.1824 7.2248 5.6627 5.7322 3.9251 4.6045 5.1887 3.6152 3.2934 3.7556 9.5077 3.4097 2.8684 5.8460 5.4905 3.1747 3.0213 5.5353 2.7509 6.9569 2.8227 3.2602 4.5943 2.2912 1.2188 7.3760 1.3681 1.8630 1.2455 1.4611 4.2855 9.3698 1.5902 1.6237 1.3863 1.4536 4.8563 1.6080 1.5453 1.2778 1.5988 2.4217 1.2133 1.1803 2.5155 1.2892 1.3751 1.1419 2.9857 3.0389 1.5429 1.2221 1.2621 6.3041 1.3544 2.9411 1.8212 1.2229 1.0893 1.2964 1.1047 1.0804 1.1047 2.2743 1.0697 7.6468 6.4575 6.4462 1.0430 1.0392 1.0924 1.0946 1.1000 1.0502 1.0612 1.0970 1.0893 1.0897 1.0913 1.0956 1.0963 1.0733 1.1182 1.1159
irintensity: 1.0008 0.4214 0.4401 0.3390 2.3228 0.4528 0.2552 1.9619 0.5254 0.9592 6.1410 8.1039 10.6107 4.2665 0.2553 19.7721 0.1416 15.5688 1.2403 24.2960 3.1742 0.1166 93.9521 25.4976 63.9928 1.4839 20.9873 6.5934 0.1471 39.3344 2.0340 7.4236 10.5741 1.9151 111.6328 33.8176 91.1485 0.2098 4.8149 59.9840 48.7426 7.3948 3.7349 0.0755 2.5031 3.1381 4.6491 13.4753 21.7289 21.5526 27.4051 11.9399 0.9388 31.3573 7.2139 0.8271 11.9419 1.5229 5.7771 16.7415 7.1756 2.5079 0.4629 57.0718 11.1676 20.1926 15.9173 11.6062 11.4651 20.6326 21.8823 16.2076 25.4522 12.6831 61.3755 6.4764 6.2691 15.3793 24.6593 18.7441 20.5686 14.6961 18.2217 14.7279 14.4179 14.4864 8.4075 24.3471 2.7195 7.1360 17.4540 0.6116 21.5616
temp: 298.150 k
press: 1.00000 atm
elementType: 16 8 8 7 7 6 6 6 6 6 6 6 6 6 6 6 6 1 1 1 1 1 1 1 1 1 1 1 1 1 1 1 1
symmnumber: 1
zpe: 673678.7 jmol-1
zpe.correction: 0.256591 hartree
zpe.thermalcorrener: 0.275622 hartree
zpe.thermalcorrenthalpy: 0.276566 hartree
zpe.thermalcorrgfe: 0.205344 hartree
zpe.sumelectzpe: -1123.373378 hartree
zpe.sumelectthermal: -1123.354347 hartree
zpe.sumelectthermalent: -1123.353403 hartree
zpe.sumelectthermalfe: -1123.424625 hartree
dipole: 0.2779 4.5640 -3.4113
dipole: 5.7047
quadrupole: -79.1823 -114.4509 -112.5017
quadrupole: -6.8099 -1.6805 8.1382
quadrupole: 22.8627 -12.4060 -10.4567 -6.8099 -1.6805 8.1382
hfenergy: -1123.6299691 hartree
pointgroup: C01 [X(C12H16N2O2S1)]
dipole: -0.3789956 -1.8695282 -1.1826329 debye
polarizability: 234.9013018|-6.5100167|184.5730576|-12.8567892|-15.2278138|145.1149093 unknown
InChI: InChI=1S/C12H16N2O2S/c1-9-3-7-12(8-4-9)17(15,16)14-13-10(2)11-5-6-11/h3-4,7-8,11,14H,5-6H2,1-2H3
charge 0 multiplicity 1
33 atoms
S  0.311393 1.702104 0.431664
O  -0.156219 1.563045 1.985579
O  0.821922 3.115708 -0.198733
N  -1.900661 0.197147 -0.251724
N  -1.134173 1.202704 -0.807223
C  -3.911208 -1.098027 0.009423
C  -3.700528 -1.422237 1.515271
C  -3.161251 -2.375311 0.458681
C  -3.163373 0.035858 -0.607042
C  -3.85776 0.937499 -1.612246
C  1.569236 0.360022 0.078588
C  2.461109 0.549257 -0.988748
C  1.586903 -0.765772 0.915916
C  3.479438 -1.624149 -0.415023
C  3.421823 -0.457706 -1.22432
C  2.557214 -1.758642 0.656484
C  4.498085 -2.712088 -0.701658
H  -4.922987 -1.238576 -0.381557
H  -4.579307 -1.716633 2.096425
H  -2.979529 -0.783772 2.033646
H  -2.082552 -2.367775 0.280392
H  -3.663781 -3.334919 0.306047
H  -4.917754 0.666392 -1.732253
H  -3.816557 2.002238 -1.298937
H  -3.364374 0.875786 -2.601722
H  -1.601552 2.124373 -0.990504
H  2.417054 1.459851 -1.594575
H  0.881804 -0.846803 1.748848
H  4.136972 -0.334076 -2.045634
H  2.598656 -2.647536 1.296319
H  4.757462 -3.276667 0.210356
H  4.099895 -3.438234 -1.436707
H  5.4288 -2.295561 -1.124432
