program: Gaussian 09
title: 000277920
version: EM64L-G09RevD.01
frameworkgroup: C1[X(C13H16BrNO)]
method: RPBEPBE
basis: SDD
operation: Freq
keyword: #p
keyword: freq=noraman
keyword: PBEPBE/SDD
title: #p freq=noraman PBEPBE/SDD
converged: YES YES NO NO
title: Mulliken charges:
elementType: Br O N C C C C C C C C C C C C C H H H H H H H H H H H H H H H H
charge: -0.013040 -0.256307 -0.441691 -0.259823 -0.482969 -0.477163 -0.423542 -0.429913 0.627770 -0.390277 -0.493388 -0.502232 -0.330024 0.604938 0.219982 -0.782022 0.228636 0.214186 0.235770 0.237165 0.210988 0.210534 0.220823 0.220508 0.210645 0.248947 0.237432 0.315241 0.300428 0.221594 0.258409 0.258395
chargesum: 0.00000
title: Mulliken charges with hydrogens summed into heavy atoms:
elementType: Br O N C C C C C C C C C C C C C
charge: -0.013040 -0.256307 -0.141262 -0.031187 -0.033013 -0.029011 0.007814 0.001241 0.627770 -0.141330 -0.255956 -0.502232 -0.014783 0.604938 0.219982 -0.043624
polarizability: 2.50509555e+02 -1.53140485e+00 1.74522454e+02 -2.09399471e-02 -7.02580973e-03 9.64895048e+01
1716.lowfreq: -22.7646 -6.1761 -0.0005 -0.0004 -0.0004 0.8121 5.2234 31.5557 45.2384
frequency: -22.6686 31.4126 45.1654 63.3143 65.0352 74.3091 108.1166 112.9467 153.6335 170.0482 218.9857 245.6658 253.9283 309.8706 397.2041 402.9512 404.6920 438.9111 503.3999 542.6439 583.2968 606.2782 620.8247 651.4296 671.5799 691.3586 736.5662 755.4246 806.3188 815.8915 854.9219 860.2035 875.0396 886.8700 920.6451 937.0527 955.5842 966.7736 969.7102 988.3670 995.9850 1024.7205 1040.7698 1066.1952 1079.7675 1133.4978 1162.8485 1173.3421 1194.4109 1217.7733 1223.5280 1223.8668 1252.3331 1268.9428 1276.9922 1292.5276 1300.4160 1301.9408 1303.9919 1331.6842 1375.6473 1389.9950 1406.5533 1449.6599 1460.8308 1463.9762 1469.1216 1472.7437 1474.7420 1491.8109 1511.4645 1563.6535 1616.2525 1626.0934 2973.5834 2988.0865 2994.5864 2996.1337 2996.3624 3012.8555 3042.6722 3058.7931 3062.9963 3081.1162 3097.5956 3098.8351 3130.0780 3152.5571 3186.2036 3485.9863
redmass: 1.6127 3.1433 1.3515 4.2264 2.3531 4.1965 3.7052 6.4924 4.3004 3.4203 5.5259 4.4882 5.7214 4.8351 4.6690 4.5634 4.0901 3.3929 2.4156 3.7806 3.5565 2.9676 2.8422 6.0720 5.3908 1.2293 3.3292 1.3436 1.6475 3.3525 4.3852 1.4455 1.4587 2.8651 2.8034 6.2966 1.8272 1.5992 1.4223 1.3596 1.6741 2.6362 1.6313 2.6197 3.7903 1.4662 1.2580 1.4879 1.4178 1.6149 1.2379 2.9869 1.5297 1.2766 1.4671 1.4849 1.3022 1.2972 1.6272 2.1408 2.9770 1.2207 3.1303 1.0452 2.2641 1.0794 1.0998 1.0861 1.1106 1.1065 2.8451 5.0392 7.0276 4.7609 1.0824 1.0605 1.0623 1.0361 1.0623 1.0660 1.1000 1.1004 1.1034 1.1047 1.0979 1.1009 1.0909 1.0915 1.0942 1.0766
irintensity: 0.0059 0.3152 2.6771 8.8392 0.3122 0.4071 0.3830 4.4853 0.3540 0.5258 0.9574 0.6294 3.9314 1.8306 5.7524 0.7027 3.6843 9.9538 2.8616 8.4631 8.9197 5.9702 1.2934 4.0507 30.1194 43.8274 18.2338 1.8526 1.0965 6.7504 7.3919 53.9926 5.3379 8.4970 13.3389 6.6255 2.6088 0.9684 0.8714 4.4837 14.4033 19.8075 14.9893 0.8221 0.1659 4.8178 9.9257 1.2853 0.1032 2.1896 2.2565 63.7687 13.2384 0.2014 14.2690 16.4829 3.7437 0.3245 49.1703 62.5118 90.8588 67.5772 35.0420 15.5348 62.7314 1.1535 19.2083 9.0794 17.0462 18.5972 500.3069 66.2973 71.2425 75.3574 7.1968 11.3755 62.5013 11.0214 47.2769 52.7686 22.5353 10.3414 18.6207 95.9962 7.0264 19.4481 15.1302 5.0404 9.6242 50.8684
temp: 298.150 k
press: 1.00000 atm
elementType: 35 8 7 6 6 6 6 6 6 6 6 6 6 6 6 6 1 1 1 1 1 1 1 1 1 1 1 1 1 1 1 1
symmnumber: 1
zpe: 686015.8 jmol-1
zpe.correction: 0.261290 hartree
zpe.thermalcorrener: 0.276586 hartree
zpe.thermalcorrenthalpy: 0.277530 hartree
zpe.thermalcorrgfe: 0.216126 hartree
zpe.sumelectzpe: -647.253385 hartree
zpe.sumelectthermal: -647.238088 hartree
zpe.sumelectthermalent: -647.237144 hartree
zpe.sumelectthermalfe: -647.298549 hartree
dipole: -1.0764 1.8632 -0.0006
dipole: 2.1518
quadrupole: -88.3476 -112.2008 -107.8680
quadrupole: 11.0810 -0.0147 -0.0098
quadrupole: 14.4579 -9.3954 -5.0625 11.0810 -0.0147 -0.0098
hfenergy: -647.5146743 hartree
pointgroup: C01 [X(C13H16Br1N1O1)]
dipole: 0.491719 -0.6890227 0.0127818 debye
polarizability: 250.1048773|5.7331564|174.8964829|-0.2766225|-1.5458375|96.520153 unknown
InChI: InChI=1S/C13H16BrNO/c1-9(16)15-13-7-6-11(8-12(13)14)10-4-2-3-5-10/h6-8,10,15H,2-5H2,1H3
charge 0 multiplicity 1
32 atoms
Br -1.396022 -3.063849 0.060611
O  -4.033313 1.741849 -0.027858
N  -3.087126 -0.410889 0.012394
C  2.646241 0.603525 -0.01362
C  3.422157 0.024842 1.207554
C  3.419369 -0.021529 -1.212775
C  4.917962 0.053681 0.77652
C  4.913706 0.061235 -0.793169
C  1.146182 0.352357 -0.006452
C  0.629366 -0.97057 0.018902
C  0.214822 1.41894 -0.025309
C  -0.755548 -1.188435 0.024482
C  -1.176664 1.200447 -0.019773
C  -1.699622 -0.1220 0.005502
C  -4.162405 0.482229 -0.003477
C  -5.535689 -0.184655 0.010914
H  2.811068 1.700392 -0.036162
H  3.091771 -1.016529 1.388636
H  3.22833 0.592819 2.134728
H  3.20753 0.494566 -2.166053
H  3.109422 -1.077686 -1.336665
H  5.469659 -0.81208 1.184221
H  5.415294 0.961617 1.163753
H  5.364825 0.996927 -1.171763
H  5.502033 -0.772607 -1.215721
H  1.308528 -1.828717 0.034161
H  0.58507 2.450843 -0.044972
H  -1.886109 2.030006 -0.034613
H  -3.317396 -1.409236 0.031384
H  -5.499052 -1.287551 0.031657
H  -6.098326 0.136521 -0.882584
H  -6.095861 0.169835 0.893347
