program: Gaussian 09
title: 000277903
version: EM64L-G09RevD.01
frameworkgroup: C1[X(C13H20N2O2S)]
method: RPBEPBE
basis: SDD
operation: Freq
keyword: #p
keyword: freq=noraman
keyword: PBEPBE/SDD
title: #p freq=noraman PBEPBE/SDD
converged: YES YES NO NO
title: Mulliken charges:
elementType: S O O N N C C C C C C C C C C C C C H H H H H H H H H H H H H H H H H H H H
charge: 0.957096 -0.517579 -0.544824 0.033693 -0.503544 0.195355 0.101530 -0.693449 -0.703574 -0.692637 -0.792665 -0.036930 -0.231970 -0.238998 0.451559 -0.366163 -0.361697 -0.799408 0.206484 0.229892 0.216717 0.196552 0.222697 0.234648 0.216704 0.226913 0.205825 0.241868 0.254468 0.233802 0.302650 0.284158 0.282147 0.243091 0.242712 0.243706 0.229569 0.229602
chargesum: 0.00000
title: Mulliken charges with hydrogens summed into heavy atoms:
elementType: S O O N N C C C C C C C C C C C C C
charge: 0.957096 -0.517579 -0.544824 0.033693 -0.200894 0.195355 0.101530 -0.040356 -0.049678 -0.043194 -0.062527 -0.036930 0.052188 0.043149 0.451559 -0.123073 -0.118985 -0.096530
polarizability: 2.51687086e+02 7.79570092e+00 1.88674805e+02 6.03039915e+00 -1.18210298e+01 1.58484840e+02
1716.lowfreq: -3.4205 0.0008 0.0012 0.0020 5.0819 13.9161 18.6437 23.8101 27.7247
frequency: 18.1973 23.2897 27.1695 37.1567 55.5750 68.9742 96.2678 128.1110 131.8691 144.3708 173.3628 178.1323 192.8884 222.3999 235.3184 253.9370 265.5549 271.1217 288.2880 296.3789 342.2860 346.3445 359.4692 372.1072 394.4672 395.0780 408.3232 424.6691 442.5790 492.9631 510.8664 549.8216 573.2179 586.5196 623.0369 665.8367 709.3338 777.7973 798.6725 810.0095 828.4966 845.9674 850.0857 919.7086 933.7236 944.2417 947.4080 955.0003 964.9960 983.3484 991.1759 995.5565 1000.1158 1006.0878 1031.6543 1049.4100 1054.5687 1059.3002 1118.7347 1148.2505 1184.3412 1203.0644 1218.2648 1224.5013 1280.0224 1297.5051 1306.2301 1371.9772 1375.8560 1383.3367 1387.0837 1394.0870 1398.4644 1404.8095 1452.3815 1461.7717 1464.1002 1464.6339 1467.7220 1471.0394 1474.1423 1474.8903 1483.0847 1485.8060 1496.9975 1575.3765 1596.5953 1597.3266 2955.2505 2974.4334 2977.6861 2980.1577 2986.3552 3030.2554 3062.8981 3069.7143 3074.0892 3077.0384 3080.2870 3084.1774 3092.1566 3097.7707 3115.6730 3135.3393 3137.0933 3163.7772 3168.1982 3218.3241
redmass: 4.5621 1.0961 2.6797 3.3154 3.5583 5.3531 4.4022 4.8417 5.3779 1.4844 1.8753 5.9894 1.5102 3.7908 1.8507 1.1135 1.9229 1.7646 3.1693 4.0770 2.7623 2.5412 3.0029 3.1537 4.0732 6.3647 2.8634 3.9222 4.2715 4.0779 3.0767 2.6621 3.2249 5.1508 6.9586 3.0455 3.2664 4.8306 2.6616 7.3166 1.3888 2.1371 1.2656 1.7216 1.6536 4.3219 1.2226 2.5588 1.3469 1.3997 1.4346 4.8614 1.4253 1.6668 1.5295 1.5943 2.2487 2.4511 1.2799 2.4090 1.1411 2.8097 2.9975 3.2561 1.3651 1.2607 2.7477 1.1866 1.2131 6.7821 1.1990 2.8820 1.2206 1.1994 1.0484 1.0563 1.0549 1.0522 1.0488 1.1035 1.2478 1.7803 1.0512 1.0566 1.0861 9.3239 6.8681 6.2228 1.0437 1.0345 1.0348 1.0389 1.0363 1.0928 1.0947 1.0997 1.0993 1.1009 1.0997 1.0990 1.1000 1.0994 1.0950 1.0894 1.0896 1.0956 1.0961 1.0737
irintensity: 1.3268 0.8779 0.5140 0.0272 0.5639 0.8009 1.3747 0.5336 0.6642 3.8430 4.6310 3.1824 0.3678 12.2048 2.3127 0.2750 8.4494 0.1373 8.8782 3.9113 7.3225 2.3847 1.9972 17.9455 19.3258 21.1017 0.4071 60.4953 14.9168 11.6787 70.2335 7.0770 6.0541 16.3851 0.1549 52.5061 0.8800 4.6563 76.8183 92.3781 24.0970 72.2736 4.1937 1.6795 5.0638 55.2943 0.6293 14.0460 2.5489 0.7099 2.2191 1.3391 1.7530 2.2859 2.3489 23.4659 12.7734 17.7620 6.7775 56.4615 10.7632 6.8457 6.3594 3.9707 6.7232 2.4657 7.6918 21.5939 7.9450 0.8417 47.7694 10.9487 15.6642 4.7472 4.4547 1.1390 7.3680 8.1953 0.4627 17.0664 14.3341 20.9618 23.5558 30.8375 23.9178 35.9824 2.1512 10.5129 14.3220 29.8488 42.9447 24.4292 25.9058 15.4946 17.9863 3.5247 37.6168 14.1935 25.5796 91.4210 15.2695 28.7621 25.1286 14.8423 7.9721 2.5885 7.0783 9.9851
temp: 298.150 k
press: 1.00000 atm
elementType: 16 8 8 7 7 6 6 6 6 6 6 6 6 6 6 6 6 6 1 1 1 1 1 1 1 1 1 1 1 1 1 1 1 1 1 1 1 1
symmnumber: 1
zpe: 802668.4 jmol-1
zpe.correction: 0.305720 hartree
zpe.thermalcorrener: 0.327101 hartree
zpe.thermalcorrenthalpy: 0.328045 hartree
zpe.thermalcorrgfe: 0.253336 hartree
zpe.sumelectzpe: -1163.807152 hartree
zpe.sumelectthermal: -1163.785772 hartree
zpe.sumelectthermalent: -1163.784828 hartree
zpe.sumelectthermalfe: -1163.859537 hartree
dipole: 0.6300 -4.8498 -2.8974
dipole: 5.6844
quadrupole: -90.5569 -124.7989 -118.5881
quadrupole: 13.0668 -0.4727 -7.8221
quadrupole: 20.7577 -13.4843 -7.2734 13.0668 -0.4727 -7.8221
hfenergy: -1164.1128724 hartree
pointgroup: C01 [X(C13H20N2O2S1)]
dipole: 0.310991 1.94193 1.0647856 debye
polarizability: 251.1033654|-10.2148666|188.3387382|-5.6294024|-12.8351804|159.4046282 unknown
InChI: InChI=1S/C13H20N2O2S/c1-10-6-8-12(9-7-10)18(16,17)15-14-11(2)13(3,4)5/h6-9,15H,1-5H3
charge 0 multiplicity 1
38 atoms
S  -0.71155 -1.840695 -0.364374
O  -0.265764 -1.89072 -1.928164
O  -1.241213 -3.162459 0.428363
N  1.537766 -0.326985 0.143308
N  0.74574 -1.257096 0.790966
C  3.577672 0.998797 -0.141714
C  2.761819 -0.090176 0.572316
C  4.902038 0.370883 -0.674556
C  2.789767 1.59712 -1.333204
C  3.912698 2.134659 0.872347
C  3.349735 -0.846259 1.753261
C  -1.935862 -0.439425 -0.145441
C  -1.954222 0.58457 -1.104783
C  -2.803565 -0.48865 0.956737
C  -3.804059 1.620997 0.158545
C  -2.901314 1.618921 -0.937723
C  -3.741002 0.557071 1.098399
C  -4.838845 2.721431 0.305798
H  5.518805 -0.058775 0.136039
H  4.690765 -0.426844 -1.409467
H  5.505088 1.149964 -1.176659
H  3.407324 2.362697 -1.839345
H  1.850693 2.066496 -0.993489
H  2.521908 0.815694 -2.064811
H  4.524571 2.910382 0.375446
H  2.987755 2.611391 1.24453
H  4.484287 1.763042 1.742463
H  4.34498 -0.471693 2.033616
H  2.683222 -0.765414 2.634192
H  3.455293 -1.928157 1.525272
H  1.182602 -2.159045 1.09338
H  -1.262239 0.56195 -1.952282
H  -2.754504 -1.321725 1.665076
H  -2.938242 2.43409 -1.669473
H  -4.432682 0.545875 1.948553
H  -5.780332 2.445337 -0.207482
H  -5.086025 2.907583 1.365367
H  -4.489504 3.669771 -0.137814
