program: Gaussian 09
title: 000277895
version: EM64L-G09RevD.01
frameworkgroup: C1[X(C15H16N2O2S)]
method: RPBEPBE
basis: SDD
operation: Freq
keyword: #p
keyword: freq=noraman
keyword: PBEPBE/SDD
title: #p freq=noraman PBEPBE/SDD
converged: YES YES NO NO
title: Mulliken charges:
elementType: S O O N N C C C C C C C C C C C C C C C H H H H H H H H H H H H H H H H
charge: 0.966359 -0.537757 -0.511251 -0.505508 0.046441 -0.031457 0.451133 -0.240980 -0.232168 -0.364476 -0.361482 -0.573364 0.481367 -0.798633 -0.208885 -0.442700 -0.377572 -0.213130 -0.217191 -0.246186 0.283019 0.286471 0.244009 0.216169 0.244150 0.244152 0.301771 0.230904 0.229765 0.244403 0.231146 0.231692 0.247381 0.226961 0.226047 0.229401
chargesum: 0.00000
title: Mulliken charges with hydrogens summed into heavy atoms:
elementType: S O O N N C C C C C C C C C C C C C C C
charge: 0.966359 -0.537757 -0.511251 -0.203736 0.046441 -0.031457 0.451133 0.042039 0.054302 -0.120326 -0.117330 -0.113187 0.481367 -0.093562 0.022261 -0.211008 -0.130191 0.013831 0.008856 -0.016785
polarizability: 2.70506073e+02 -1.14648802e+01 2.16679797e+02 1.40049116e+01 -9.61228178e+00 1.64620679e+02
1716.lowfreq: -3.5815 -0.0021 -0.0017 -0.0013 4.1108 7.3693 10.8860 18.6628 27.1704
frequency: 10.3919 18.6394 27.1556 33.4472 35.8163 42.8664 76.0632 90.0094 131.0707 154.4088 168.1231 187.4339 213.1985 227.5589 268.7091 281.9354 296.9781 299.9047 356.3528 375.0922 395.4658 404.9288 407.5064 425.5112 437.3070 471.2918 509.9059 551.3379 582.8997 584.8634 616.9509 621.4034 706.1048 707.5952 744.0926 762.9814 778.2119 797.6195 814.4909 829.3741 848.9439 856.1104 880.5116 919.6853 922.5356 952.1982 964.2518 979.2836 983.0716 990.2164 991.8110 993.7097 996.7072 1009.0069 1026.8656 1049.4381 1055.8408 1082.1707 1101.3205 1120.3467 1172.0557 1185.7025 1188.4110 1194.8879 1204.4428 1218.7142 1267.9238 1289.4033 1298.5749 1332.4982 1373.3925 1382.3582 1382.8827 1393.3474 1399.7981 1439.2736 1448.2574 1471.7189 1474.2021 1474.7339 1483.2803 1587.3014 1595.6561 1596.1490 1597.0513 1613.5448 2980.8608 2984.0749 3000.4082 3051.2053 3063.4138 3092.6357 3117.2358 3121.2677 3134.5992 3136.9856 3138.6941 3145.2487 3163.3069 3164.4269 3170.6332 3241.7885
redmass: 5.1592 3.9036 3.9592 1.0429 4.0159 5.1022 7.2329 5.3043 6.5903 4.7017 3.1228 7.5544 8.5290 8.2233 4.3968 3.3296 5.2258 4.3071 3.0741 3.3167 9.2150 2.8214 2.8582 5.3341 4.6174 3.0624 3.1296 2.3601 4.7438 5.3096 6.1142 6.9585 1.8646 3.2582 1.9892 1.9448 4.8457 3.5034 8.7468 1.4235 1.2449 1.2473 1.7227 1.7091 1.5492 10.9984 1.3139 1.3867 1.4021 6.0515 1.4420 4.4057 1.4202 3.0524 2.2324 1.5946 2.4853 1.6014 2.5127 1.2868 1.0574 1.1387 1.1203 1.2825 2.3463 3.0358 1.1998 1.3631 1.2603 1.2774 1.5433 7.1597 6.5378 2.8992 1.2214 1.8143 1.2301 1.1008 1.3114 1.6548 2.2329 7.0337 6.0394 6.1909 6.9402 6.0675 1.0389 1.0611 1.0875 1.0995 1.0948 1.1001 1.0865 1.0869 1.0914 1.0894 1.0897 1.0961 1.1015 1.0959 1.0961 1.0743
irintensity: 0.4415 1.0726 0.5130 0.3336 0.5673 0.8362 1.0450 0.8546 1.0261 1.0588 7.3268 7.2145 4.9547 13.8142 10.2312 2.9863 25.1101 1.4267 15.5507 12.8697 26.2906 0.3371 0.1571 80.1088 15.6576 43.0258 72.7647 14.4141 5.9514 19.7231 0.0339 0.1972 44.7667 0.6842 128.9970 100.9284 18.0519 16.7855 113.2705 25.6507 0.1123 0.1943 32.3790 17.0006 3.3316 67.8353 2.2711 0.2083 1.0235 0.4406 3.3279 1.7214 0.9380 15.9559 9.6843 25.1487 26.7762 13.2562 9.9330 7.4458 0.0833 11.6702 0.7631 0.3950 2.0321 6.4391 14.3161 4.4713 2.6218 0.3566 14.2291 0.7657 0.7794 11.1296 16.5867 6.4528 21.5757 17.2273 14.4849 20.2847 19.2802 10.3589 12.8665 1.5616 0.4498 8.2728 23.4989 20.5633 31.9056 12.0368 17.3592 14.7947 7.4604 1.9684 10.8667 14.3995 7.0328 41.2013 26.6864 3.2598 5.8003 3.9399
temp: 298.150 k
press: 1.00000 atm
elementType: 16 8 8 7 7 6 6 6 6 6 6 6 6 6 6 6 6 6 6 6 1 1 1 1 1 1 1 1 1 1 1 1 1 1 1 1
symmnumber: 1
zpe: 723390.0 jmol-1
zpe.correction: 0.275525 hartree
zpe.thermalcorrener: 0.295717 hartree
zpe.thermalcorrenthalpy: 0.296661 hartree
zpe.thermalcorrgfe: 0.221716 hartree
zpe.sumelectzpe: -1237.547213 hartree
zpe.sumelectthermal: -1237.527021 hartree
zpe.sumelectthermalent: -1237.526077 hartree
zpe.sumelectthermalfe: -1237.601022 hartree
dipole: 2.3057 4.9386 -0.5362
dipole: 5.4766
quadrupole: -115.7682 -122.9475 -124.5974
quadrupole: -26.4288 0.5417 0.6223
quadrupole: 5.3362 -1.8431 -3.4931 -26.4288 0.5417 0.6223
hfenergy: -1237.8227379 hartree
pointgroup: C01 [X(C15H16N2O2S1)]
dipole: 1.6720459 -1.3577296 -0.0586833 debye
polarizability: 250.937805|29.4120768|239.1974908|-2.2394882|0.5500175|161.6712532 unknown
InChI: InChI=1S/C15H16N2O2S/c1-13-7-9-15(10-8-13)20(18,19)17-16-12-11-14-5-3-2-4-6-14/h2-10,12,17H,11H2,1H3
charge 0 multiplicity 1
36 atoms
S  -2.891905 0.820845 0.45068
O  -3.894287 0.878438 1.730643
O  -3.15966 1.695611 -0.892374
N  -1.20907 1.278058 1.26295
N  -0.222629 1.475146 0.321956
C  -2.575866 -0.957046 -0.047297
C  -2.155987 -3.615174 -0.804339
C  -2.805228 -1.960089 0.907032
C  -2.150193 -1.2105 -1.360062
C  -2.589596 -3.297929 0.511025
C  -1.940082 -2.5575 -1.727573
C  1.938997 2.349413 -0.416044
C  3.279943 1.835611 0.114637
C  -1.958047 -5.059654 -1.225313
C  0.821903 2.22151 0.593622
C  4.444928 2.639523 0.047873
C  3.38024 0.53362 0.671006
C  5.686613 2.154206 0.519909
C  4.618702 0.046395 1.143208
C  5.777409 0.855149 1.069449
H  -3.150623 -1.702878 1.913371
H  -2.000158 -0.386411 -2.063902
H  1.637811 1.79163 -1.32218
H  2.046906 3.413537 -0.705517
H  -2.760953 -4.104769 1.232602
H  -1.603098 -2.78884 -2.744477
H  -1.418732 2.026711 1.961245
H  -1.163259 -5.155787 -1.985224
H  -1.693273 -5.700745 -0.366897
H  -2.886603 -5.469252 -1.668059
H  0.949206 2.738449 1.564995
H  4.380999 3.649271 -0.376816
H  2.483862 -0.095654 0.730237
H  6.578465 2.788318 0.459847
H  4.681768 -0.961884 1.568333
H  6.738197 0.477474 1.436756
