program: Gaussian 09
title: 000277882
version: EM64L-G09RevD.01
frameworkgroup: C1[X(C14H11N3O3)]
method: RPBEPBE
basis: SDD
operation: Freq
keyword: #p
keyword: freq=noraman
keyword: PBEPBE/SDD
title: #p freq=noraman PBEPBE/SDD
converged: YES YES NO NO
title: Mulliken charges:
elementType: O O O N N N C C C C C C C C C C C C C C H H H H H H H H H H H
charge: -0.209904 -0.213816 -0.209129 -0.417699 0.075466 0.025182 0.478904 0.381808 0.261341 -0.364959 -0.345622 -0.357594 -0.351462 -0.345527 -0.356263 -0.383122 0.178462 -0.215413 -0.230497 -0.221745 0.234875 0.294483 0.287513 0.288940 0.274813 0.222433 0.214684 0.237972 0.234282 0.237659 0.293932
chargesum: 0.00000
title: Mulliken charges with hydrogens summed into heavy atoms:
elementType: O O O N N N C C C C C C C C C C C C C C
charge: -0.209904 -0.213816 -0.209129 -0.123766 0.075466 0.025182 0.478904 0.381808 0.261341 -0.130083 -0.051139 -0.070080 -0.062522 -0.070713 -0.133830 -0.168437 0.178462 0.022558 0.003785 0.015914
polarizability: 4.56371933e+02 3.23261484e+00 1.83794004e+02 -4.19608062e+00 -9.11382509e-01 7.59780008e+01
1716.lowfreq: -6.7515 -3.3435 -0.0009 -0.0006 -0.0004 4.6603 21.7175 31.5804 35.0379
frequency: 21.6386 31.5265 35.0253 53.4098 70.7270 93.1748 107.9752 163.0686 182.3254 199.4875 224.5564 261.5537 277.6466 343.2639 350.1037 399.1537 403.8345 412.8931 421.3120 471.2826 506.6353 510.2465 537.8951 613.0197 624.5337 644.0674 663.6551 667.7120 672.6986 685.0682 703.2639 743.6005 773.1280 792.2828 828.7813 845.7122 856.3882 876.8535 895.8579 934.8579 936.6940 985.5689 989.2476 989.3720 1001.3363 1007.9184 1014.3092 1015.9293 1037.3832 1087.6080 1092.5941 1109.4788 1130.3893 1175.8753 1176.3282 1191.7646 1216.6382 1232.1306 1243.8358 1297.5282 1317.9510 1337.1208 1361.3190 1385.3637 1404.6868 1421.4766 1434.8375 1474.2819 1481.1318 1500.7805 1562.3140 1582.9031 1591.8371 1609.9315 1611.5509 1627.9977 2975.0263 3117.6414 3134.1891 3136.0164 3148.4125 3160.6868 3165.5876 3172.5620 3184.4146 3187.5769 3381.3680
redmass: 6.9388 5.1740 7.0167 6.8513 6.2033 6.6725 6.4024 5.7804 9.4589 4.9119 5.0684 4.4792 5.3806 6.9057 6.0648 4.8035 3.3945 2.9378 5.1303 5.6072 4.1204 4.3462 6.1646 6.1488 7.1605 1.2903 5.8296 4.6073 6.7378 5.4538 1.5406 4.3757 8.0849 2.3533 6.1522 1.3286 1.2512 1.4255 5.2797 1.5646 1.4534 1.5781 1.5305 3.0369 2.9980 1.3450 1.3460 4.0067 2.4652 1.6860 3.2388 1.4636 3.2121 1.1842 1.2177 1.1201 4.2569 2.7434 2.2638 1.3549 1.3349 1.7988 5.7159 9.1212 6.0389 4.3033 2.2289 2.0439 2.3802 2.0701 6.3579 6.1028 6.5162 5.9556 6.3306 8.0129 1.0872 1.0881 1.0905 1.0870 1.0917 1.0957 1.0898 1.1010 1.0945 1.0966 1.0751
irintensity: 0.0359 0.1977 0.8133 5.3508 0.2125 1.1711 3.0093 2.2988 3.2306 1.8262 17.6806 13.4715 6.6700 0.2998 3.1080 3.2618 0.6668 0.0939 4.3050 2.9119 6.0829 1.1189 1.7982 2.4093 0.5789 59.0612 18.2389 29.6368 31.9566 13.7682 94.7759 0.1437 38.1617 23.2115 0.1194 9.8654 2.3601 26.0578 44.8884 47.5447 17.8741 4.7526 0.2705 1.6412 0.7262 2.1763 0.0076 29.2283 0.2642 84.7884 47.1376 86.4206 396.8239 98.0972 77.7259 56.9602 790.2821 141.1906 84.9261 1.4124 2.7181 4.1725 104.8846 0.4107 15.7190 41.0038 4.9498 79.8401 9.0191 486.4813 47.4256 21.0641 18.2113 2.2734 48.3055 128.9507 57.2670 17.4771 10.5126 1.0369 17.8861 14.2799 0.5978 25.9374 0.4869 1.1935 0.3561
temp: 298.150 k
press: 1.00000 atm
elementType: 8 8 8 7 7 7 6 6 6 6 6 6 6 6 6 6 6 6 6 6 1 1 1 1 1 1 1 1 1 1 1
symmnumber: 1
zpe: 593952.5 jmol-1
zpe.correction: 0.226225 hartree
zpe.thermalcorrener: 0.243114 hartree
zpe.thermalcorrenthalpy: 0.244058 hartree
zpe.thermalcorrgfe: 0.178724 hartree
zpe.sumelectzpe: -928.515483 hartree
zpe.sumelectthermal: -928.498593 hartree
zpe.sumelectthermalent: -928.497649 hartree
zpe.sumelectthermalfe: -928.562983 hartree
dipole: 8.0896 -5.7033 -0.7970
dipole: 9.9300
quadrupole: -137.9317 -109.8398 -117.6767
quadrupole: -3.4070 -0.6044 -2.0096
quadrupole: -16.1156 11.9763 4.1394 -3.4070 -0.6044 -2.0096
hfenergy: -928.7417073 hartree
pointgroup: C01 [X(C14H11N3O3)]
dipole: -3.1705279 2.270197 -0.2383814 debye
polarizability: 456.2681647|1.7697176|183.4433693|8.1642115|6.0173073|76.4324039 unknown
InChI: InChI=1S/C14H11N3O3/c18-14(12-4-2-1-3-5-12)16-15-10-11-6-8-13(9-7-11)17(19)20/h1-10,16H
charge 0 multiplicity 1
31 atoms
O  -2.430185 -1.98937 -0.042229
O  6.978522 0.710579 -0.000263
O  6.526784 -1.510284 0.27264
N  -1.700835 0.242537 -0.091987
N  -0.374162 -0.100204 -0.029586
N  6.157191 -0.282488 0.109812
C  1.9519 0.549043 -0.076453
C  4.706991 0.004178 0.045492
C  -4.108957 -0.229083 -0.02445
C  2.902299 1.603381 -0.191816
C  2.413111 -0.789851 0.101663
C  4.281658 1.339252 -0.131943
C  3.786645 -1.066101 0.163015
C  -5.133926 -1.090884 -0.494507
C  -4.454824 1.057333 0.470979
C  0.521334 0.860894 -0.144574
C  -2.702545 -0.762075 -0.042251
C  -6.47739 -0.664842 -0.496853
C  -5.80201 1.479976 0.472514
C  -6.814749 0.623894 -0.018363
H  2.555246 2.634266 -0.329415
H  1.672756 -1.590642 0.187234
H  5.028054 2.13294 -0.21832
H  4.164145 -2.08293 0.298303
H  -4.852654 -2.089236 -0.845093
H  -3.693746 1.717888 0.904694
H  0.242927 1.924182 -0.292981
H  -7.260968 -1.334358 -0.867102
H  -6.063123 2.467653 0.867415
H  -7.859304 0.953872 -0.016893
H  -1.986681 1.222181 -0.242584
