program: Gaussian 09
title: 000277887
version: EM64L-G09RevD.01
frameworkgroup: C1[X(C12H15N3O)]
method: RPBEPBE
basis: SDD
operation: Freq
keyword: #p
keyword: freq=noraman
keyword: PBEPBE/SDD
title: #p freq=noraman PBEPBE/SDD
converged: YES YES NO NO
title: Mulliken charges:
elementType: O N N N C C C C C C C C C C C C H H H H H H H H H H H H H H H
charge: -0.248386 0.010608 -0.391706 -0.649354 -0.224935 -0.468948 -0.498176 -0.448261 0.023895 0.319614 -0.366659 -0.348139 -0.235743 -0.256413 -0.241290 0.289496 0.247662 0.226166 0.243165 0.252886 0.202767 0.235990 0.208876 0.279719 0.223133 0.227418 0.223889 0.292418 0.227406 0.299375 0.343527
chargesum: 0.00000
title: Mulliken charges with hydrogens summed into heavy atoms:
elementType: O N N N C C C C C C C C C C C C
charge: -0.248386 0.010608 -0.099288 -0.006452 0.022727 0.000383 -0.042524 -0.003395 0.023895 0.319614 -0.086940 -0.125006 -0.008325 -0.032523 -0.013884 0.289496
polarizability: 2.39690391e+02 -2.57657973e+00 1.60971679e+02 -1.97829499e+00 -1.85314732e+01 9.15792592e+01
1716.lowfreq: -0.0002 0.0002 0.0002 2.7586 5.7337 10.5451 32.8325 40.0434 56.1695
frequency: 32.7829 39.9835 56.1607 66.7708 79.7505 115.2399 145.3897 175.3119 221.8937 259.8167 278.0246 283.2116 304.7583 363.4831 406.4115 412.4435 473.0615 487.3517 496.2349 549.1172 557.4541 614.9590 637.8069 645.9156 672.5725 700.2858 709.0197 750.7924 774.3002 784.8964 839.2606 851.7154 872.9306 923.2791 930.4862 948.9290 969.3869 978.4052 984.2084 990.1102 997.7837 1024.2757 1030.8914 1049.3319 1070.1413 1081.5926 1097.5004 1134.0892 1171.8174 1178.6046 1190.2350 1204.4916 1217.5903 1233.8501 1248.6902 1252.1541 1286.3555 1291.8570 1304.7775 1318.7567 1379.1898 1433.2563 1450.7404 1462.2531 1474.5383 1478.8097 1490.7354 1548.9123 1584.6010 1602.6768 1611.4857 1682.2784 2962.7341 2983.5226 3020.0780 3030.2606 3068.3191 3089.7774 3109.5079 3123.3304 3133.7242 3148.6815 3159.7188 3169.8219 3422.7700 3537.1483 3695.0598
redmass: 3.8149 3.0573 3.2815 5.0785 5.1405 4.3329 2.1805 4.7074 5.2022 3.2291 2.3853 2.2614 3.8569 2.6807 2.8693 3.4272 2.2058 1.8400 1.9786 4.1565 1.4315 6.1607 2.6643 5.5513 4.3413 1.8419 6.0326 1.9974 1.9242 1.2723 2.4918 1.2541 2.4211 1.4341 1.8902 2.0808 2.3694 1.4161 2.8852 4.4731 1.3516 2.4283 2.2073 2.4726 2.7625 1.7113 2.1810 3.6468 1.0524 1.2747 1.1234 1.1877 1.2875 1.2592 1.4285 1.4049 1.8951 1.9268 3.2607 1.4000 7.3956 2.3412 1.0869 1.0865 1.8077 1.1463 2.2529 8.3701 6.2506 1.2216 6.1144 5.4365 1.0828 1.0629 1.0589 1.0630 1.1029 1.1070 1.1069 1.0845 1.0885 1.0930 1.0963 1.0993 1.0750 1.0458 1.1034
irintensity: 11.5912 6.8713 0.7838 2.3068 5.2251 0.0823 1.0740 0.6362 2.5096 0.0719 3.9235 9.2694 0.6986 63.4391 0.0678 6.6041 86.9707 115.2567 44.9614 19.4723 115.0539 0.9781 5.0856 5.7619 7.7195 34.7986 41.2761 8.5115 55.0781 1.4067 6.2056 1.0599 0.8307 4.9194 4.7648 1.8827 1.4392 2.4011 11.2579 2.1619 1.7779 11.6660 7.2913 27.0524 16.2244 34.3019 2.9653 137.4202 0.1017 5.9577 2.4452 1.2538 4.8530 2.3063 9.2464 3.0334 174.0538 350.8313 21.4218 5.4081 0.4060 10.1626 1.7987 8.1573 255.8529 18.5113 141.8223 68.9738 8.1837 136.2874 0.0624 273.4700 16.1686 48.3064 56.1720 23.2068 11.2235 15.5865 52.0075 1.4394 8.7762 38.7346 23.9922 13.4786 18.8817 53.3908 44.3695
temp: 298.150 k
press: 1.00000 atm
elementType: 8 7 7 7 6 6 6 6 6 6 6 6 6 6 6 6 1 1 1 1 1 1 1 1 1 1 1 1 1 1 1
symmnumber: 1
zpe: 661670.3 jmol-1
zpe.correction: 0.252017 hartree
zpe.thermalcorrener: 0.267261 hartree
zpe.thermalcorrenthalpy: 0.268205 hartree
zpe.thermalcorrgfe: 0.208135 hartree
zpe.sumelectzpe: -704.535920 hartree
zpe.sumelectthermal: -704.520676 hartree
zpe.sumelectthermalent: -704.519732 hartree
zpe.sumelectthermalfe: -704.579802 hartree
dipole: -1.5369 5.9219 -1.4802
dipole: 6.2946
quadrupole: -72.3158 -100.1688 -95.1245
quadrupole: -11.4153 5.2981 -2.9765
quadrupole: 16.8872 -10.9658 -5.9214 -11.4153 5.2981 -2.9765
hfenergy: -704.7879374 hartree
pointgroup: C01 [X(C12H15N3O1)]
dipole: -0.5257552 -2.1082334 1.1882713 debye
polarizability: 236.3690473|14.8655051|146.2361255|16.4535663|-33.1605005|109.6361563 unknown
InChI: InChI=1S/C12H15N3O/c13-12(16)15-14-11(10-7-4-8-10)9-5-2-1-3-6-9/h1-3,5-6,10,15H,4,7-8,13H2
charge 0 multiplicity 1
31 atoms
O  -3.167798 1.95247 -1.450266
N  -1.008154 0.567704 -0.300328
N  -2.313634 0.139574 -0.181833
N  -4.620406 0.439863 -0.42584
C  -0.204644 -1.58006 0.764519
C  0.941474 -2.654448 0.625357
C  -1.16724 -2.612307 0.031947
C  -0.139704 -3.747431 0.342151
C  -0.020013 -0.192075 0.15095
C  1.3347 0.42177 0.024142
C  1.577474 1.403271 -0.979861
C  2.393756 0.085103 0.911118
C  2.839899 2.016661 -1.095896
C  3.657816 0.705031 0.79556
C  3.889978 1.669353 -0.210781
C  -3.349694 0.933046 -0.739943
H  -0.506022 -1.489068 1.829636
H  1.592865 -2.81148 1.499839
H  1.574061 -2.451558 -0.254756
H  -1.241353 -2.400937 -1.049035
H  -2.185606 -2.752665 0.442596
H  0.070951 -4.461444 -0.469829
H  -0.408588 -4.312205 1.252003
H  0.754907 1.676745 -1.647645
H  2.227652 -0.642006 1.712598
H  3.007983 2.766713 -1.877034
H  4.458112 0.438263 1.495186
H  -2.547417 -0.754788 0.266634
H  4.872189 2.146234 -0.303446
H  -4.79547 -0.305103 0.245535
H  -5.411172 0.942272 -0.820876
