program: Gaussian 09
title: 000277871
version: EM64L-G09RevD.01
frameworkgroup: C1[X(C6H7BrN2)]
method: RPBEPBE
basis: SDD
operation: Freq
keyword: #p
keyword: freq=noraman
keyword: PBEPBE/SDD
title: #p freq=noraman PBEPBE/SDD
converged: NO YES NO YES
title: Mulliken charges:
elementType: Br N N C C C C C C H H H H H H H
charge: -0.033336 -0.704318 -0.710127 0.692454 0.572313 -0.589562 -0.499482 -0.479812 -0.140825 0.208539 0.221062 0.234408 0.302443 0.318148 0.306481 0.301613
chargesum: 0.00000
title: Mulliken charges with hydrogens summed into heavy atoms:
elementType: Br N N C C C C C C
charge: -0.033336 -0.083727 -0.102032 0.692454 0.572313 -0.381023 -0.499482 -0.258750 0.093584
polarizability: 1.49307998e+02 -5.84525907e+00 9.96162235e+01 6.19371500e-03 2.97724979e-03 3.74604832e+01
1716.lowfreq: -11.6315 -8.1273 0.0003 0.0004 0.0005 4.4475 96.8618 197.2757 212.7222
frequency: 96.8579 197.2750 212.7221 257.5399 282.0518 324.1698 336.9688 351.1300 369.5312 426.5864 456.7509 466.5120 550.2895 579.6077 629.7249 703.0082 738.6739 771.7733 842.3076 921.2354 953.6347 988.4082 1025.6150 1075.6711 1145.5604 1237.4642 1271.0126 1350.4905 1395.7614 1471.1382 1493.6493 1588.2581 1622.1437 1636.6372 1643.5358 3111.9628 3136.1888 3161.8597 3554.0035 3571.6685 3700.5211 3712.1114
redmass: 5.4022 6.3268 3.8940 8.8125 3.4016 3.2102 1.3261 1.0498 1.2003 1.3677 1.7526 2.7993 6.2393 6.2520 3.4343 2.1264 6.2041 1.4668 2.4761 1.3506 2.4903 3.7459 1.7400 1.3814 1.2602 1.8507 1.4778 2.6889 7.5857 4.4073 3.6441 5.4275 2.0762 1.8870 1.2190 1.0909 1.0879 1.0967 1.0455 1.0449 1.1034 1.1040
irintensity: 2.4346 0.4764 12.6406 3.2204 0.0494 3.1451 249.0885 1.4284 243.8288 104.4662 20.8286 0.7918 4.6019 15.2142 13.0615 1.5000 2.4118 24.0030 97.0799 0.1059 5.6802 19.5170 27.6884 7.5202 27.7764 51.8501 37.5943 29.2853 17.1820 29.1739 99.9171 49.0480 33.3261 391.7674 198.5034 23.9517 10.6844 10.2208 60.6313 64.2919 31.8764 20.1223
temp: 298.150 k
press: 1.00000 atm
elementType: 35 7 7 6 6 6 6 6 6 1 1 1 1 1 1 1
symmnumber: 1
zpe: 319175.7 jmol-1
zpe.correction: 0.121568 hartree
zpe.thermalcorrener: 0.130574 hartree
zpe.thermalcorrenthalpy: 0.131519 hartree
zpe.thermalcorrgfe: 0.087305 hartree
zpe.sumelectzpe: -355.153415 hartree
zpe.sumelectthermal: -355.144408 hartree
zpe.sumelectthermalent: -355.143464 hartree
zpe.sumelectthermalfe: -355.187677 hartree
dipole: 3.3552 1.8642 0.0128
dipole: 3.8383
quadrupole: -46.5874 -49.2499 -69.2774
quadrupole: -1.5203 0.0331 0.0153
quadrupole: 8.4508 5.7883 -14.2392 -1.5203 0.0331 0.0153
hfenergy: -355.2749827 hartree
pointgroup: C01 [X(C6H7Br1N2)]
dipole: 1.1900464 -0.9296418 -0.0046885 debye
dipolederiv: -0.6604315 0.1126299 -0.0001415 0.1170601 -0.1495111 0.0000414 0.0001189 -0.0001025 -0.0539848 -0.6555806 -0.5911757 0.0006489 -0.6320499 -0.9452115 0.0008659 0.0009347 0.0021748 -0.7250385 -1.5771259 0.1874446 -0.0014381 0.2825981 -0.1568896 0.0001799 -0.0039643 0.0004096 -0.7663697 0.4876853 0.6450869 -0.0005531 0.5889521 1.0390135 -0.0007489 -0.0002003 -0.0005737 0.2135376 1.6881211 -0.1204502 0.000847 -0.368291 0.3420542 -0.0002192 0.0005698 -0.0001056 0.1956752 -0.5926575 -0.2591232 0.0000904 -0.173399 -0.0885922 -0.0001354 0.0001246 -0.0001926 -0.3328723 0.8292699 -0.1814816 0.0002155 -0.5813494 -0.4271023 0.0000273 0.0000722 0.0000795 -0.2568543 -0.5441251 -0.0131102 0.0000711 0.3978025 -0.186778 0.0000695 0.0003685 0.0000401 -0.3200238 0.2622998 0.1304962 -0.0000527 0.2776434 0.1240679 0.0000005 -0.0002475 0.0000485 -0.0234593 -0.0092942 0.0706849 -0.0000292 0.0735783 -0.1251406 0.0000447 -0.0000307 0.0001525 0.1882395 -0.0709794 -0.1022525 -0.0000069 -0.0835468 -0.028426 0.0000725 -0.0000278 -0.0000443 0.1897124 0.0883514 0.0696222 -0.0000039 0.0615861 -0.0495272 0.000017 0.0000158 0.0000362 0.1516856 0.1360706 0.0535695 0.0000686 0.0610931 0.1851619 -0.000231 -0.0002334 -0.0010761 0.382118 0.2013087 0.020859 -0.0002428 0.0057124 0.2423358 0.0000343 -0.0005365 -0.0005151 0.378172 0.2199881 -0.0020194 0.0003093 0.0090629 0.1140132 0.0003082 0.0015644 0.0004119 0.3901601 0.1970993 -0.0207807 0.0002174 -0.0364528 0.110532 -0.0003264 0.0014717 -0.0007431 0.3893023 unknown
polarizability: 149.9027336|-2.0639453|99.0214864|0.0068916|-0.0100296|37.4604847 unknown
InChI: InChI=1S/C6H7BrN2/c7-5-2-1-4(8)3-6(5)9/h1-3H,8-9H2
charge 0 multiplicity 1
16 atoms
Br -3.065458 0.833614 -0.000249
N  -1.54715 -1.952373 0.001061
N  3.037063 -0.255518 0.001075
C  -0.663785 -0.878132 0.000529
C  1.660689 -0.014343 0.000512
C  0.742647 -1.095614 0.000555
C  -1.125005 0.471711 0.000175
C  1.16606 1.323845 0.000221
C  -0.223643 1.549767 0.000057
H  1.115113 -2.12833 0.000906
H  1.858731 2.172325 0.000237
H  -0.607909 2.574707 -0.000204
H  -1.203158 -2.907391 -0.000365
H  -2.550764 -1.788354 -0.000381
H  3.69673 0.516059 -0.001092
H  3.40344 -1.202274 -0.000738
