program: Gaussian 09
title: 000277888
version: EM64L-G09RevD.01
frameworkgroup: C1[X(C14H14N2O3S)]
method: RPBEPBE
basis: SDD
operation: Freq
keyword: #p
keyword: freq=noraman
keyword: PBEPBE/SDD
title: #p freq=noraman PBEPBE/SDD
converged: YES YES NO NO
title: Mulliken charges:
elementType: S O O O N N C C C C C C C C C C C C C C H H H H H H H H H H H H H H
charge: 0.918601 -0.580163 -0.506354 -0.270221 -0.245048 -0.508065 -0.082851 -0.193473 -0.248944 0.454023 0.208474 -0.374984 -0.370475 0.228046 -0.800506 -0.304074 -0.341361 -0.232691 -0.222498 -0.221979 0.298130 0.287971 0.242471 0.241750 0.228831 0.230911 0.241587 0.323904 0.353700 0.268674 0.275294 0.231806 0.235172 0.234343
chargesum: 0.00000
title: Mulliken charges with hydrogens summed into heavy atoms:
elementType: S O O O N N C C C C C C C C C C C C C C
charge: 0.918601 -0.580163 -0.506354 -0.270221 -0.245048 0.169539 -0.082851 0.104656 0.039027 0.454023 0.208474 -0.132512 -0.128725 0.228046 -0.099176 -0.035401 -0.066068 -0.000884 0.012674 0.012364
polarizability: 3.18773678e+02 -1.84265033e-01 1.81483930e+02 4.99453063e+00 -2.61302696e+01 1.70113692e+02
1716.lowfreq: -44.8609 -16.1234 -5.0287 -0.5965 -0.0017 -0.0012 -0.0007 15.7950 26.6129
frequency: -44.7548 15.5518 26.5683 30.9087 57.2005 64.6855 88.4331 111.3990 124.4131 144.9352 174.4547 195.4867 214.0606 228.7137 241.3311 277.9924 298.9353 302.9055 365.6390 377.2244 388.0560 402.5780 405.0374 420.2223 443.6468 458.2277 508.2238 568.9349 586.8361 612.5594 620.0305 623.7496 674.4596 696.9101 705.8320 711.0925 731.9244 774.0986 792.6930 798.2655 823.6153 843.7838 859.6281 914.9252 948.2503 958.1630 980.4575 987.3091 989.3032 990.4060 992.1670 998.6486 1006.7884 1033.6007 1047.9020 1048.7229 1087.4146 1118.3164 1174.7258 1184.7396 1188.6312 1208.1229 1216.5285 1244.7185 1296.9311 1316.8045 1355.8923 1379.4717 1384.9273 1389.7326 1398.8928 1433.8907 1470.3663 1471.1709 1473.2615 1474.8149 1530.3510 1587.7773 1592.2238 1593.3000 1605.5401 1670.1122 2979.6124 3061.8521 3091.1025 3130.7320 3135.2762 3138.3216 3143.2341 3157.1454 3164.6594 3169.2527 3176.7169 3178.3376 3384.0385 3545.4213
redmass: 1.0141 5.2883 4.2344 4.0121 6.2754 5.4320 6.1896 5.0158 8.0067 7.3265 5.6550 7.1081 4.2464 5.7243 5.0681 5.1531 4.2186 4.8695 2.7987 4.0804 5.3365 2.8343 2.8578 2.6254 3.1264 4.5224 3.2438 5.3718 6.1827 6.5317 6.8979 6.7509 5.0872 1.5791 3.2134 1.6978 5.8305 4.8585 2.1539 13.0330 1.3791 1.2502 1.2458 16.7986 1.4236 1.3261 1.3824 1.4593 2.6987 2.0191 5.0402 5.7449 1.3362 2.0488 1.8874 1.9657 1.6054 1.2921 1.0563 1.1388 1.1742 3.7100 3.0759 1.2792 1.2639 1.3418 6.2336 6.2120 9.2508 2.9757 1.2236 2.2804 1.1301 2.1745 1.0624 2.1962 11.0544 6.3156 6.6355 6.1654 6.0133 1.0796 1.0389 1.0948 1.1000 1.0855 1.0894 1.0904 1.0894 1.0941 1.0956 1.0961 1.0984 1.0954 1.0459 1.0983
irintensity: 0.4413 0.6042 1.4411 0.3629 0.3553 3.6717 2.0244 0.1820 5.6305 9.6522 12.0063 1.2672 15.8687 35.6942 26.4521 9.7686 15.3514 6.6017 18.9688 12.2074 3.2393 0.2231 0.3768 12.7099 74.7064 33.5800 86.7898 2.2691 31.2749 4.7438 5.5133 40.5030 28.9071 162.5068 2.2126 366.2359 17.2245 17.7532 22.5067 99.9937 42.0837 4.9526 1.3880 53.0598 3.4755 0.9844 1.3348 0.2635 0.3903 2.1820 5.6307 90.1418 0.3978 7.2091 29.1414 10.8665 7.0758 9.1111 0.8353 39.3181 44.5332 70.1312 5.7173 13.6563 3.9572 8.9305 394.4843 1.1743 7.4181 10.0980 15.2434 19.6641 16.9402 28.8486 13.5888 1.6703 69.5734 4.6069 5.9112 4.2265 7.2886 47.8887 27.8750 21.3483 15.0349 0.0501 14.7362 11.0551 13.8466 20.9485 8.7253 16.8466 11.4811 6.0213 41.5933 31.6309
temp: 298.150 k
press: 1.00000 atm
elementType: 16 8 8 8 7 7 6 6 6 6 6 6 6 6 6 6 6 6 6 6 1 1 1 1 1 1 1 1 1 1 1 1 1 1
symmnumber: 1
zpe: 663881.1 jmol-1
zpe.correction: 0.252859 hartree
zpe.thermalcorrener: 0.272008 hartree
zpe.thermalcorrenthalpy: 0.272952 hartree
zpe.thermalcorrgfe: 0.202833 hartree
zpe.sumelectzpe: -1273.505074 hartree
zpe.sumelectthermal: -1273.485925 hartree
zpe.sumelectthermalent: -1273.484981 hartree
zpe.sumelectthermalfe: -1273.555100 hartree
dipole: -1.7104 -2.6988 -4.1122
dipole: 5.2076
quadrupole: -89.7128 -125.3190 -124.6541
quadrupole: -13.1976 -3.3327 -10.5063
quadrupole: 23.5158 -12.0904 -11.4254 -13.1976 -3.3327 -10.5063
hfenergy: -1273.7579333 hartree
pointgroup: C01 [X(C14H14N2O3S1)]
dipole: -0.7656367 -1.7976259 -0.6165192 debye
polarizability: 318.8194522|-4.5221651|152.0586736|0.6275322|-12.2553228|199.4931744 unknown
InChI: InChI=1S/C7H7N2O.C7H7O2S/c8-9-7(10)6-4-2-1-3-5-6;1-6-2-4-7(5-3-6)10(8)9/h1-5H,8H2;2-5H,1H3
charge 0 multiplicity 1
34 atoms
S  1.078536 1.661823 -0.718813
O  1.267626 2.093885 -2.294291
O  1.090579 2.828548 0.42254
O  -0.665285 0.234078 1.187435
N  -0.7579 0.627147 -1.081036
N  -1.405779 1.171291 -2.149077
C  2.372148 0.356139 -0.326663
C  2.524841 -0.051394 1.008166
C  3.159586 -0.125837 -1.384137
C  4.36041 -1.52324 0.257267
C  -1.378376 0.262873 0.137138
C  3.534695 -0.997483 1.287513
C  4.160718 -1.073023 -1.074469
C  -2.822663 -0.159855 0.153139
C  5.420914 -2.562592 0.571817
C  -3.555326 -0.561181 -0.995243
C  -3.448018 -0.198165 1.429644
C  -4.896873 -0.981759 -0.865029
C  -4.791403 -0.60521 1.551874
C  -5.520567 -0.998216 0.40416
H  1.87259 0.34784 1.789718
H  3.005499 0.24602 -2.401915
H  3.680348 -1.333035 2.320654
H  4.797367 -1.46112 -1.877907
H  6.251396 -2.528142 -0.154295
H  5.841657 -2.419916 1.582376
H  4.993379 -3.583426 0.535795
H  -1.909112 2.061303 -2.018142
H  -0.862894 1.103314 -3.016731
H  -3.078046 -0.550752 -1.978584
H  -2.859343 0.091766 2.305725
H  -5.453757 -1.299671 -1.753134
H  -5.268795 -0.619471 2.537539
H  -6.563848 -1.319436 0.499065
