program: Gaussian 09
title: 000277853
version: EM64L-G09RevD.01
frameworkgroup: C1[X(C9H8N2O4)]
method: RPBEPBE
basis: SDD
operation: Freq
keyword: #pfreq=noraman
keyword: PBEPBE/SDD
title: #p freq=noraman PBEPBE/SDD
converged: YES YES NO NO
title: Mulliken charges:
elementType: O O O O N N C C C C C C C C C H H H H H H H H
charge: -0.312933 -0.168797 -0.154992 -0.202385 0.118380 0.077056 0.221621 -0.332192 -0.315955 -0.212420 -0.214081 -0.215435 0.178598 0.203525 -0.709422 0.272514 0.255707 0.240939 0.236732 0.239079 0.271366 0.271371 0.251725
chargesum: 0.00000
title: Mulliken charges with hydrogens summed into heavy atoms:
elementType: O O O O N N C C C C C C C C C
charge: -0.312933 -0.168797 -0.154992 -0.202385 0.118380 0.077056 0.221621 -0.059678 -0.060247 0.028519 0.022651 0.023644 0.178598 0.203525 0.085039
polarizability: 2.25405575e+02 -4.83360169e+00 1.39397496e+02 4.76847015e-02 -1.89698986e-01 5.34973723e+01
1716.lowfreq: -14.8920 -10.0413 -0.0009 -0.0007 0.0006 2.8293 3.8772 6.4383 37.0224
frequency: -11.5934 -7.0581 37.0121 64.2881 77.1060 91.6770 157.7018 160.4506 230.2951 266.0454 291.1701 326.7833 400.2985 402.3282 434.3496 441.7043 468.1863 520.2741 612.0940 626.7632 667.8075 674.7816 675.4653 696.3465 749.7398 793.5547 839.9967 861.6297 877.4188 913.3521 953.5097 990.2420 993.9982 994.9504 1011.4687 1027.8438 1037.4744 1088.5512 1152.7702 1177.1988 1180.4297 1187.4411 1222.0136 1318.4695 1388.3879 1391.0399 1402.5544 1438.9283 1443.3333 1449.2785 1477.6096 1586.8683 1597.5963 1610.4105 1698.8426 3010.5385 3093.0380 3136.0375 3137.4496 3148.2202 3159.1756 3171.3119 3182.9034
redmass: 4.6467 4.7644 5.7544 6.3837 1.1499 8.0756 8.1097 5.3375 4.9095 9.8636 10.7940 4.1887 2.7998 8.0467 3.7618 4.2555 8.4115 8.1995 6.4509 7.0583 5.7976 6.9123 6.4553 1.6408 12.6251 2.0738 5.8771 1.2478 7.2279 8.5644 1.4188 5.6183 2.7257 1.3907 1.3392 2.0973 1.5280 1.5629 3.1585 1.0557 4.2528 1.4234 3.6501 1.3124 2.2185 9.7489 2.2374 2.2453 1.0976 1.0448 2.2291 6.2137 7.7280 6.0626 12.8034 1.0367 1.0971 1.0859 1.1000 1.0891 1.0939 1.0982 1.0978
irintensity: 2.1092 0.8768 0.2213 0.0712 1.1067 0.0337 1.7180 0.0503 1.5528 1.9452 7.1405 1.8465 0.0075 0.1440 0.2165 0.1260 2.1206 2.8811 8.0006 18.6453 23.9317 6.3985 37.0881 80.3602 268.6301 28.7621 12.5631 0.1855 35.5621 824.5832 3.4421 0.5056 12.1703 0.2767 0.1550 2.1761 2.4398 6.9770 2.6248 0.5405 228.8095 2.1196 193.8083 0.9408 160.1191 1.8002 10.8149 22.1711 16.8600 17.7552 3.6505 6.7406 25.1912 23.2889 198.1927 0.7519 2.4594 0.2339 4.8353 6.7876 11.5379 22.8894 7.8577
temp: 298.150 k
press: 1.00000 atm
elementType: 8 8 8 8 7 7 6 6 6 6 6 6 6 6 6 1 1 1 1 1 1 1 1
symmnumber: 1
zpe: 419999.9 jmol-1
zpe.correction: 0.159970 hartree
zpe.thermalcorrener: 0.172319 hartree
zpe.thermalcorrenthalpy: 0.173263 hartree
zpe.thermalcorrgfe: 0.119850 hartree
zpe.sumelectzpe: -756.930034 hartree
zpe.sumelectthermal: -756.917684 hartree
zpe.sumelectthermalent: -756.916740 hartree
zpe.sumelectthermalfe: -756.970153 hartree
dipole: 5.9856 5.0746 0.0396
dipole: 7.8473
quadrupole: -88.3394 -85.7735 -86.1113
quadrupole: -6.7161 -0.1614 -0.0942
quadrupole: -1.5980 0.9679 0.6301 -6.7161 -0.1614 -0.0942
hfenergy: -757.0900031 hartree
pointgroup: C01 [X(C9H8N2O4)]
dipole: 2.3905148 1.9435641 -0.1997298 debye
dipolederiv: -2.4612076 0.4949187 -0.0608936 0.2482187 -0.4431629 0.0331542 -0.0352924 0.0342196 -0.1576039 -0.7193229 -0.1454732 0.0169357 0.166953 -0.9691214 0.0802269 -0.0172797 0.0805936 -0.2829365 -0.6149491 -0.1632418 0.0144351 -0.2049891 -0.6784737 0.0519287 0.0179046 0.0518502 -0.1854517 -0.8191645 0.2589036 -0.0312242 0.149524 -0.6210068 0.0438463 -0.0198815 0.0453398 -0.2194868 1.1799578 -0.1800831 0.0238846 0.4435757 -0.2787569 0.026053 -0.0411159 0.0232581 -0.0415217 1.7213502 -0.1228437 0.0227853 0.2242799 1.0202443 -0.0933739 -0.0108892 -0.0952914 0.1535886 -0.7900057 -0.168277 0.0187984 -0.1830654 -0.1331882 0.0134826 0.0197781 0.0133708 -0.0149433 0.1434002 0.1635015 -0.0193519 -0.1764469 0.0464856 -0.0189125 0.0217845 -0.0176265 -0.099812 0.1321434 -0.0613883 0.0087694 0.2231279 0.0002073 -0.0135229 -0.0253877 -0.0138768 -0.1099707 -0.0143261 -0.1981986 0.0251742 -0.2424509 -0.1008548 -0.0068091 0.0304575 -0.006631 -0.1474335 -0.2979933 0.0547643 -0.0072795 0.1037201 0.1486999 -0.0367339 -0.0136091 -0.036554 -0.1448921 0.1350286 0.0501901 -0.0051475 0.0517719 0.0563938 -0.0219898 -0.0053806 -0.0221761 -0.1205637 2.7603285 -0.0598162 0.0083416 -0.914036 1.4356662 -0.1367671 0.1022304 -0.1349746 0.2729392 -0.5046684 0.0691428 -0.0101806 -0.049331 0.5063248 -0.040263 0.0001573 -0.0408421 0.0940738 -0.1356274 0.0360837 -0.0042209 0.0784206 -0.3098308 0.0396123 -0.0105283 0.0406682 0.0764564 0.1354614 -0.0436832 0.0052165 -0.0001423 -0.0040837 0.0202436 0.0003271 0.0197787 0.1559498 0.043689 0.0830051 -0.0109321 0.119131 0.0412201 0.0140859 -0.0158165 0.0135349 0.1495556 -0.0554341 0.0842297 -0.0112665 0.0939199 0.0238413 0.017441 -0.0124319 0.0174264 0.1592587 0.0699451 -0.018128 0.0019186 -0.051995 -0.0951296 0.0314847 0.0059381 0.0314077 0.1555931 -0.0880896 -0.0687033 0.0075626 -0.0727605 0.0695345 0.0106504 0.0081394 0.0106122 0.1560629 0.1091829 0.0068752 -0.0760176 0.0247127 0.0989128 0.0055245 -0.0599964 0.0347668 0.0073453 0.1053031 0.0239901 0.0751113 0.0362818 0.0878928 -0.0214662 0.0560721 -0.0506888 0.0221707 -0.0350016 -0.0957683 0.007581 -0.0684201 0.0981854 0.0021042 0.0048202 0.0018345 0.1216219 unknown
polarizability: 225.2017723|-6.2876924|138.4502018|1.1928001|-9.8853538|54.6484695 unknown
InChI: InChI=1S/C9H8N2O4/c1-7(11(13)14)10-15-9(12)8-5-3-2-4-6-8/h2-6H,1H3
charge 0 multiplicity 1
23 atoms
O  -0.425044 0.092783 -0.047721
O  0.346088 -2.14366 0.209409
O  -4.291531 -1.29253 0.077926
O  -4.990841 0.869668 -0.157763
N  -1.762258 -0.470608 0.003311
N  -4.076837 -0.038793 -0.053626
C  1.947619 -0.309692 -0.000459
C  3.074281 -1.169301 0.110337
C  2.137396 1.087692 -0.172847
C  4.37634 -0.635391 0.049701
C  3.443659 1.61508 -0.233617
C  4.563626 0.757219 -0.122392
C  0.605655 -0.943871 0.071007
C  -2.650625 0.484315 -0.09759
C  -2.502297 1.966523 -0.24548
H  2.90717 -2.243342 0.242204
H  1.270404 1.74756 -0.25861
H  5.242508 -1.299578 0.135403
H  3.590493 2.692017 -0.366878
H  5.576757 1.171333 -0.16973
H  -2.985114 2.31172 -1.175862
H  -3.006411 2.489816 0.585193
H  -1.435439 2.232841 -0.259613
