program: Gaussian 09
title: 000277833
version: EM64L-G09RevD.01
frameworkgroup: C1[X(C8H7NO5)]
method: RPBEPBE
basis: SDD
operation: Freq
keyword: #pfreq=noraman
keyword: PBEPBE/SDD
title: #p freq=noraman PBEPBE/SDD
converged: YES YES NO NO
title: Mulliken charges:
elementType: O O O O O N C C C C C C C C H H H H H H H
charge: -0.242535 -0.423864 -0.390432 -0.238749 -0.210679 -0.389003 0.372415 0.175595 0.122489 -0.430250 0.036899 -0.785377 0.135033 0.112520 0.282161 0.341059 0.247104 0.258390 0.247661 0.396164 0.383399
chargesum: 0.00000
title: Mulliken charges with hydrogens summed into heavy atoms:
elementType: O O O O O N C C C C C C C C
charge: -0.242535 -0.027700 -0.007033 -0.238749 -0.210679 -0.047944 0.372415 0.175595 0.122489 -0.148088 0.036899 -0.032223 0.135033 0.112520
polarizability: 1.45989666e+02 -8.94729724e+00 1.32896700e+02 1.25619611e+00 4.45668687e-01 6.20989445e+01
1716.lowfreq: -0.0009 -0.0006 -0.0006 4.6530 6.3862 7.3751 26.7540 66.5913 92.5893
frequency: 26.7231 66.5844 92.5884 100.3190 136.6888 148.9026 173.9870 176.3874 213.0440 279.6373 291.3699 371.8100 397.8413 425.5410 498.0631 511.1615 546.6716 561.8451 588.2959 593.2992 611.7967 624.6296 707.3684 709.2805 722.5916 766.0657 793.1109 875.5937 905.8470 981.8225 1011.9092 1035.1169 1052.0449 1064.1107 1101.9798 1173.6968 1218.2490 1249.0341 1311.2538 1323.2730 1404.4650 1407.0638 1431.8213 1467.0611 1476.2994 1547.1000 1617.9712 1627.9144 1639.8186 1661.2556 2983.1433 3059.5464 3116.4675 3197.5583 3499.0557 3509.0064 3531.6828
redmass: 11.3808 6.6266 7.3881 1.1463 4.2594 7.7900 5.5205 5.2700 4.8483 3.8088 8.7887 7.0445 7.4689 4.0190 2.8773 3.4477 7.0039 3.5814 1.5054 2.0124 3.2522 3.6406 4.7705 4.8042 3.1877 1.9025 4.8676 1.3681 8.4298 2.2392 3.6903 3.3404 1.5264 2.3526 2.6832 1.7220 2.8019 2.4386 2.7903 2.1982 1.2252 3.0551 2.6475 1.0429 1.2817 11.7149 5.2512 6.5919 9.1051 9.6861 1.0390 1.0979 1.0973 1.0934 1.0771 1.0638 1.0643
irintensity: 2.0674 4.4264 2.3261 0.9643 1.6786 0.5936 3.9572 4.6759 0.8958 0.6908 1.1367 9.9383 7.0779 2.4021 18.2888 12.6132 22.9927 29.8983 124.5684 60.4807 14.9842 87.7790 13.5095 11.0466 6.0486 103.7324 7.3321 20.3603 11.7803 30.0152 190.6032 3.1622 13.0520 275.7253 53.1952 42.1945 10.7064 3.9263 73.6186 10.4664 20.2680 60.4149 15.9140 17.7899 16.9996 57.8233 518.1654 151.4760 178.2277 189.8553 19.9034 11.3076 8.5745 6.9062 51.1785 32.6640 56.7652
temp: 298.150 k
press: 1.00000 atm
elementType: 8 8 8 8 8 7 6 6 6 6 6 6 6 6 1 1 1 1 1 1 1
symmnumber: 1
zpe: 380512.8 jmol-1
zpe.correction: 0.144930 hartree
zpe.thermalcorrener: 0.158153 hartree
zpe.thermalcorrenthalpy: 0.159097 hartree
zpe.thermalcorrgfe: 0.104221 hartree
zpe.sumelectzpe: -738.930946 hartree
zpe.sumelectthermal: -738.917723 hartree
zpe.sumelectthermalent: -738.916779 hartree
zpe.sumelectthermalfe: -738.971654 hartree
dipole: -3.4444 2.1084 -1.5982
dipole: 4.3432
quadrupole: -51.5290 -92.9227 -84.7516
quadrupole: 5.7193 -5.5718 1.6500
quadrupole: 24.8721 -16.5216 -8.3505 5.7193 -5.5718 1.6500
hfenergy: -739.0758755 hartree
pointgroup: C01 [X(C8H7N1O5)]
dipole: -1.2537332 -0.9987117 0.5920694 debye
dipolederiv: -0.4103882 0.0960045 -0.0126148 -0.0841476 -1.3198988 0.0841225 0.0084439 0.1025671 -0.352553 -1.1195234 -0.1019416 -0.1712582 -0.2276602 -0.3665854 -0.0326625 -0.1780205 -0.0021161 -0.4002232 -0.4302694 -0.1251118 -0.3068947 -0.1188691 -0.5259897 -0.3346229 -0.3273201 -0.3834075 -0.9816931 -0.6341488 0.1567813 -0.0575807 -0.0848754 -1.0437818 -0.0212924 -0.0603404 0.0233002 -0.3301523 -0.7369904 -0.2076448 0.3010558 -0.2253818 -0.4339566 0.0430174 0.0407606 -0.1087189 -0.8294351 -0.4514246 -0.508081 0.0325568 0.3329645 -0.5601796 0.0470476 -0.0379779 -0.0086095 -0.2597584 0.7564279 0.2112035 0.0339604 -0.6210666 0.3583851 -0.0626261 0.0970235 -0.0065722 0.0637058 0.2464122 0.4264079 -0.0313126 0.4558665 0.0425416 0.0455797 -0.0064658 0.0270488 0.0713711 -0.1409658 0.3697655 -0.0624966 -0.3317567 -0.445176 -0.0298625 0.0082154 0.0467872 -0.1028214 -0.8246476 -0.3169779 -0.015863 0.2380696 -0.1718685 0.0183149 -0.0787785 -0.0394322 -0.2020371 0.3533193 -0.0588167 0.023074 0.098531 1.6043812 -0.1260081 -0.0310836 -0.1609107 0.198964 -0.174663 -0.0936716 -0.0106008 0.0330798 0.0106314 0.0063173 -0.0145248 -0.0008681 0.0618932 1.5171322 -0.2641147 0.264281 0.1155193 1.4363095 0.0310613 0.2518849 -0.0248703 0.2797659 1.1385133 0.4881539 -0.0489678 0.4980159 0.6878439 0.2797104 0.2039122 0.4472298 1.5294304 0.1153048 -0.0321419 -0.001456 -0.063058 0.0456823 0.0064169 -0.0091767 0.0056479 0.1752961 0.199198 -0.0182091 -0.0052993 -0.0180963 0.1738024 0.0096922 -0.0036446 0.0147694 0.3020874 -0.021118 0.0054478 0.0558382 0.0416439 0.0648797 -0.0887133 0.1100568 -0.0599507 0.0023646 0.0950008 0.0513809 -0.0056507 -0.0485247 -0.0871667 0.012469 0.0008326 0.0189741 0.124362 0.0041202 -0.0098966 -0.0530941 0.0113164 0.0839821 0.0786852 -0.1114232 0.045916 -0.0404022 0.3421448 0.0202723 -0.0016265 0.0833654 0.125713 0.0102054 0.0115784 -0.0119246 0.3921074 0.1765658 -0.0888097 0.0739495 -0.0849359 0.320451 0.0231479 0.126048 0.0751403 0.2977278 unknown
polarizability: 142.4849765|10.8325143|135.8840741|4.7571923|-3.6919711|62.61626 unknown
InChI: InChI=1S/C8H7NO5/c1-3-2-4(7(11)12)5(8(13)14)6(10)9-3/h2,9,11,13H,1H3
charge 0 multiplicity 1
21 atoms
O  -0.814734 2.708208 -0.244999
O  2.394811 -1.250117 0.527267
O  1.920715 1.755853 1.230492
O  1.003409 -3.084736 0.255176
O  2.290451 1.381632 -1.034771
N  -2.153499 0.795189 -0.161315
C  -2.372873 -0.571263 -0.074579
C  0.05159 -0.843153 0.126361
C  0.256108 0.534363 0.028593
C  -1.272622 -1.403204 0.067805
C  -0.885507 1.446899 -0.132242
C  -3.80319 -1.046366 -0.140609
C  1.157601 -1.841656 0.297831
C  1.592959 1.227011 -0.012545
H  -1.39248 -2.485007 0.137401
H  -2.947552 1.43644 -0.267978
H  -4.406292 -0.62085 0.683664
H  -3.848261 -2.143215 -0.064009
H  -4.280735 -0.750425 -1.09372
H  3.098048 -1.949313 0.603439
H  2.763153 2.282111 1.154734
