program: Gaussian 09
title: 000277830
version: EM64L-G09RevD.01
frameworkgroup: C1[X(C9H8ClNO4)]
method: RPBEPBE
basis: SDD
operation: Freq
keyword: #p
keyword: freq=noraman
keyword: PBEPBE/SDD
title: #p freq=noraman PBEPBE/SDD
converged: YES YES NO NO
title: Mulliken charges:
elementType: Cl O O O O N C C C C C C C C C H H H H H H H H
charge: 0.005506 -0.281147 -0.390719 -0.226955 -0.196024 0.076959 0.149778 0.414531 -0.373699 0.178804 -0.486762 0.185884 -0.774344 0.070143 -0.497006 0.282951 0.261932 0.237556 0.236614 0.250436 0.238146 0.248971 0.388443
chargesum: 0.00000
title: Mulliken charges with hydrogens summed into heavy atoms:
elementType: Cl O O O O N C C C C C C C C C
charge: 0.005506 -0.281147 -0.002275 -0.226955 -0.196024 0.076959 0.149778 0.414531 -0.090748 0.178804 -0.486762 0.185884 -0.038241 0.070143 0.240547
polarizability: 1.58185436e+02 -7.15970931e+00 1.60109484e+02 -5.18874823e-01 1.48165176e+00 7.18134009e+01
1716.lowfreq: -56.6792 0.0012 0.0014 0.0017 4.4507 6.1505 6.4842 30.3595 50.5648
frequency: -56.6312 30.3121 50.5465 91.4245 96.0053 113.6026 120.9105 146.0452 162.2543 198.9054 214.6802 221.1662 269.9742 284.3231 338.9703 376.0808 404.5470 444.9400 490.3681 517.9964 562.5221 590.8900 613.0225 697.9132 700.8470 711.0174 715.4095 784.6335 804.0633 885.3905 930.6507 943.5237 999.4623 1001.9755 1050.6365 1076.6773 1115.7325 1150.5346 1160.3622 1201.3029 1255.5412 1305.7620 1320.7118 1341.6878 1395.1069 1422.2965 1426.3220 1453.3776 1462.1837 1462.6635 1467.7310 1532.7398 1576.9819 1628.4907 1655.3664 2989.9829 3009.6013 3068.2457 3113.5706 3124.8236 3157.0053 3189.4109 3511.3225
redmass: 1.0166 7.6425 7.9169 1.5437 2.5646 4.8350 3.7011 10.1203 6.1620 4.2593 5.0707 6.5093 4.2279 9.2514 5.5483 7.5666 7.1846 6.7186 3.2669 8.3343 4.3369 1.5496 4.1672 5.7510 7.1185 5.3252 9.2996 6.5918 7.5094 7.0762 1.3620 7.8696 1.7601 4.2865 1.5915 3.2458 1.2637 1.4758 3.1654 1.7035 5.6379 2.9589 7.4092 5.9399 1.2616 3.5055 1.2049 1.0486 1.0600 1.2394 1.0457 6.5116 8.2266 10.3626 10.1497 1.0385 1.0295 1.0972 1.1049 1.0984 1.1051 1.0929 1.0639
irintensity: 0.3188 1.4307 0.4116 1.6606 1.6295 0.3099 0.9646 0.2576 0.4029 6.0017 2.7363 4.4810 6.0274 2.5141 27.3904 1.7258 7.7490 5.1648 14.4617 0.6279 22.5682 105.5408 1.2573 41.6182 16.1733 28.2563 5.6827 10.6477 44.5107 37.1887 12.4436 31.8879 18.6836 170.1480 8.7865 124.3197 0.0345 12.1207 183.2820 49.9131 316.3815 42.2602 20.2652 36.6402 25.5020 58.9523 34.9365 16.1610 14.7836 6.6130 17.6144 26.9535 187.7811 96.6862 226.6384 10.4348 28.8308 12.9957 20.5427 6.3741 12.8981 1.3537 41.0237
temp: 298.150 k
press: 1.00000 atm
elementType: 17 8 8 8 8 7 6 6 6 6 6 6 6 6 6 1 1 1 1 1 1 1 1
symmnumber: 1
zpe: 413552.3 jmol-1
zpe.correction: 0.157514 hartree
zpe.thermalcorrener: 0.172042 hartree
zpe.thermalcorrenthalpy: 0.172986 hartree
zpe.thermalcorrgfe: 0.114619 hartree
zpe.sumelectzpe: -1162.370105 hartree
zpe.sumelectthermal: -1162.355577 hartree
zpe.sumelectthermalent: -1162.354633 hartree
zpe.sumelectthermalfe: -1162.413000 hartree
dipole: -4.5511 3.1684 1.3701
dipole: 5.7121
quadrupole: -84.7800 -83.1157 -96.5254
quadrupole: -3.9947 0.6454 -6.3685
quadrupole: 3.3604 5.0247 -8.3851 -3.9947 0.6454 -6.3685
hfenergy: -1162.527619 hartree
pointgroup: C01 [X(C9H8Cl1N1O4)]
dipole: -1.311852 1.7314814 0.5757257 debye
dipolederiv: -0.4495993 0.4044095 0.01311 0.3862533 -0.5692138 -0.0080376 0.0086497 -0.0065176 -0.0557983 -1.2374109 0.4195848 0.036927 0.6493792 -0.8621878 -0.0257321 0.0377636 -0.0167446 -0.2867995 -0.3939372 0.0012604 0.1240126 -0.0228083 -0.5637446 0.413452 0.1153272 0.4630678 -1.0046406 -0.7675125 -0.1446488 0.0203729 0.0861663 -0.8244666 -0.0014473 0.0216296 0.0124645 -0.2726525 -0.360166 -0.1061385 -0.0704029 -0.1242672 -0.7824391 -0.2731849 0.0062697 -0.0219508 -0.8343617 -0.3683822 -0.1785588 0.0049257 0.1661894 -0.8678391 0.0019692 0.0097722 0.0085448 -0.1640395 -0.3556118 -0.0210747 0.0182886 -0.0993686 0.3113457 -0.007959 0.0083862 0.0164381 0.0331416 -0.3321073 0.3228447 0.0245434 -0.0558894 -0.3506176 0.0349026 0.010511 -0.0220761 -0.0196931 -0.2494207 -0.4040032 0.0048932 -0.010737 -0.3622746 -0.0012899 0.011653 0.0324368 -0.0877735 0.3285554 0.4888001 -0.0070176 0.2290238 0.7958708 -0.0111245 -0.0103349 -0.0160704 0.0327456 0.8183537 -0.6369983 -0.0329215 -0.7055497 1.0408931 0.0063189 -0.0258821 0.0199389 0.0105533 1.617647 -0.1357237 -0.0551284 -0.5603805 1.3530189 0.0217887 -0.0501993 -0.0124523 0.2292686 0.0000158 -0.052348 0.0007886 -0.1408567 -0.3151563 0.0057546 0.0011286 0.0022257 0.0350855 0.5388715 0.1753309 -0.0490243 0.2984601 1.3251355 -0.0786312 -0.0919635 -0.3184098 1.5569104 0.7272389 -0.1889046 -0.0169962 -0.0980656 0.2477674 0.002805 -0.0178104 0.0078045 0.2709455 0.1193965 0.0626871 0.0008719 0.0590735 0.034007 -0.0029962 0.0001502 -0.0028332 0.1533681 -0.0751398 -0.0379447 0.0043137 0.0573104 0.1058706 -0.0013166 0.0041064 0.0000543 0.1236925 0.065089 -0.0015454 -0.078245 -0.0109298 0.0202715 0.0712328 -0.0399014 0.1073071 -0.0238167 0.0699332 -0.0044316 0.0747487 -0.0141365 0.0173094 -0.0717413 0.0351247 -0.1096968 -0.0282363 -0.032915 0.0351932 -0.0147659 -0.0611063 0.0701746 -0.0910027 -0.0585973 -0.0625239 -0.0426999 0.0361993 0.0392937 0.0033071 0.1038752 -0.0819012 -0.0064006 0.0040643 -0.0039265 0.1239563 -0.0279584 0.0380738 0.0145771 -0.0576097 0.0663231 0.0987869 0.0575379 0.0626929 -0.044998 0.3288608 -0.0751579 -0.0211788 -0.074026 0.1918531 -0.0761467 -0.0373853 -0.1397733 0.2958422 unknown
polarizability: 154.1318094|-5.278998|164.0605773|-3.1693296|1.020126|71.9159344 unknown
InChI: InChI=1S/C9H8ClNO4/c1-4-3-5(9(14)15-2)6(8(12)13)7(10)11-4/h3,12H,1-2H3
charge 0 multiplicity 1
23 atoms
Cl 3.020352 -1.831125 -0.080906
O  -2.55249 1.458268 0.115663
O  -0.212944 -2.627334 1.228311
O  -2.447211 -0.867539 0.10342
O  -0.239041 -2.768929 -1.09724
N  2.404877 0.793835 -0.060785
C  -0.386153 0.441923 0.031666
C  0.466042 -0.696523 -0.003731
C  0.179833 1.737926 0.015076
C  1.586028 1.892856 -0.033133
C  1.855333 -0.425034 -0.048059
C  -1.871231 0.245156 0.086772
C  2.247872 3.250649 -0.054825
C  -0.049512 -2.112751 -0.054588
C  -4.032642 1.356399 0.164718
H  -0.476293 2.610088 0.040419
H  3.341199 3.131113 -0.080115
H  1.93381 3.832505 -0.940962
H  1.974626 3.841833 0.838539
H  -4.404512 0.829246 -0.729431
H  -4.383452 2.396942 0.189429
H  -4.344317 0.80655 1.06813
H  -0.561776 -3.558554 1.169732
