program: Gaussian 09
title: 000277870
version: EM64L-G09RevD.01
frameworkgroup: C1[X(C20H24)]
method: RPBEPBE
basis: SDD
operation: Freq
keyword: #p
keyword: freq=noraman
keyword: PBEPBE/SDD
title: #p freq=noraman PBEPBE/SDD
converged: YES YES NO NO
title: Mulliken charges:
elementType: C C C C C C C C C C C C C C C C C C C C H H H H H H H H H H H H H H H H H H H H H H H H
charge: 0.172132 0.171851 0.317242 0.317113 0.325594 0.326067 -0.314544 -0.313782 0.476944 0.476520 -0.607155 -0.606959 -0.619369 -0.618982 -0.855662 -0.855820 -0.852032 -0.851904 -0.817057 -0.817137 0.223029 0.222377 0.232209 0.231775 0.233685 0.233772 0.247992 0.225493 0.230559 0.225666 0.230701 0.247967 0.241618 0.233211 0.225280 0.225043 0.241754 0.233210 0.233720 0.223461 0.223495 0.223786 0.223487 0.233653
chargesum: 0.00000
title: Mulliken charges with hydrogens summed into heavy atoms:
elementType: C C C C C C C C C C C C C C C C C C C C
charge: 0.172132 0.171851 0.317242 0.317113 0.325594 0.326067 -0.091516 -0.091405 0.476944 0.476520 -0.374945 -0.375184 -0.385684 -0.385210 -0.151618 -0.151487 -0.151923 -0.151898 -0.136382 -0.136211
polarizability: 4.03758069e+02 5.28261181e-02 1.97792220e+02 -1.21002430e+00 4.96090338e-02 1.49506782e+02
1716.lowfreq: -5.1523 -0.0007 -0.0006 -0.0003 5.1652 12.3142 18.7328 28.3850 32.8385
frequency: 16.4314 28.2846 32.8342 33.8351 41.9304 96.7827 97.2340 154.3418 166.6166 170.0122 172.8651 187.1550 195.1175 220.5661 221.0259 242.2824 247.6060 261.6442 274.2956 281.3942 304.0531 335.7217 355.3683 404.0637 404.8156 452.4069 489.6822 507.0352 522.0910 522.4311 523.2140 547.6107 554.2799 561.8584 575.6351 580.9252 584.3152 732.6703 742.4304 760.2300 834.5069 854.7963 867.9755 873.5658 896.3335 896.5452 930.5926 938.9997 958.8342 959.9611 981.2563 1015.0627 1016.1315 1018.3390 1019.8380 1033.1373 1036.2576 1038.8258 1039.5676 1042.5404 1043.6476 1048.0275 1048.4927 1148.5989 1165.1701 1207.4637 1229.9335 1255.5961 1260.8257 1304.4856 1307.1386 1310.9957 1323.9203 1365.1495 1368.4157 1396.0770 1396.1927 1398.2143 1398.8659 1400.8092 1400.8583 1414.9181 1417.7010 1438.3092 1452.1940 1468.5494 1470.4799 1471.3796 1472.0845 1473.1387 1473.2945 1474.2467 1474.8852 1484.5423 1484.6963 1493.4278 1494.9565 1570.4497 1573.9389 1614.5278 1620.5010 1632.6867 2968.2900 2968.3859 2970.8115 2970.9342 2971.5715 2971.8175 3045.2022 3045.5142 3049.2140 3049.4603 3051.9159 3052.3728 3081.4068 3081.8272 3081.9496 3082.0106 3082.5374 3082.6367 3107.2145 3107.7415 3112.6057 3112.9449 3119.6508 3131.9371
redmass: 1.1083 3.1418 3.7786 2.9967 1.0356 3.5329 3.6721 1.8565 4.4687 1.9845 1.7346 1.5573 1.6461 2.3764 2.2214 1.1054 1.1002 3.0338 2.4965 2.7816 2.8328 2.8046 2.4943 3.5741 4.0433 5.8046 3.1573 3.5903 3.2726 4.4923 3.0991 3.3006 4.2084 4.1234 3.9583 3.3675 3.3685 2.9610 3.4334 4.1703 3.7773 1.7433 1.3054 1.4909 1.3096 1.3093 2.4981 2.2355 3.4820 3.2361 1.1520 1.6425 1.6208 1.7167 1.7064 1.5336 1.6567 1.5415 1.5902 1.5378 1.5479 1.6065 1.6080 3.1486 1.9752 1.6944 1.5445 1.9909 1.4834 1.6963 5.9417 4.5749 1.5008 3.8138 3.8467 1.2303 1.2300 1.2732 1.2788 1.2943 1.2401 2.3545 2.4793 2.2864 2.0478 1.0645 1.0719 1.0494 1.0508 1.0710 1.0554 1.0863 1.1078 1.1341 1.1492 1.2771 1.4448 6.5348 6.0524 5.6252 5.9195 5.6206 1.0391 1.0392 1.0390 1.0390 1.0387 1.0388 1.0950 1.0950 1.0940 1.0941 1.0948 1.0946 1.0997 1.0995 1.0995 1.0997 1.0987 1.0988 1.0908 1.0907 1.0916 1.0915 1.0892 1.0845
irintensity: 0.4624 0.0195 0.1798 0.2035 0.4006 0.1757 0.0646 3.0203 0.7350 4.2114 5.7383 1.5606 1.0124 0.0116 0.1020 0.0800 0.4807 0.0532 0.7381 1.2082 3.9491 0.3647 0.7467 0.0736 0.0240 8.6618 0.0848 0.3288 0.1267 0.1070 0.5293 0.6797 0.0955 0.1985 0.8794 2.8115 3.7791 4.0098 3.9552 9.0660 0.0989 1.7591 29.4182 11.3702 0.0496 0.0407 0.1638 1.6186 0.3210 0.0384 36.0101 7.7224 0.7266 12.7808 1.6838 0.4698 1.3565 4.6495 5.7146 2.8433 2.4975 32.2294 24.4258 0.0815 0.7463 0.0626 1.4979 0.6140 0.0897 8.5546 0.0823 1.0936 0.9079 0.8028 3.7875 8.3312 9.2340 24.5985 2.6988 8.5759 4.5219 0.8668 3.0074 0.3585 1.6500 13.1080 18.1457 4.6565 11.6336 4.2936 11.0792 25.9076 9.0453 49.0534 18.4037 0.2951 61.7128 8.1398 11.7884 0.0114 52.4584 0.0126 35.3448 27.3518 26.4610 43.6412 81.3199 7.7725 13.4537 33.0241 19.0952 25.6562 26.3925 25.4625 11.4861 2.9049 39.5016 5.0463 20.4408 36.5054 35.4046 33.5760 63.4139 5.4419 0.2598 31.5817
temp: 298.150 k
press: 1.00000 atm
elementType: 6 6 6 6 6 6 6 6 6 6 6 6 6 6 6 6 6 6 6 6 1 1 1 1 1 1 1 1 1 1 1 1 1 1 1 1 1 1 1 1 1 1 1 1
symmnumber: 1
zpe: 983365.6 jmol-1
zpe.correction: 0.374544 hartree
zpe.thermalcorrener: 0.396002 hartree
zpe.thermalcorrenthalpy: 0.396947 hartree
zpe.thermalcorrgfe: 0.322572 hartree
zpe.sumelectzpe: -775.079848 hartree
zpe.sumelectthermal: -775.058390 hartree
zpe.sumelectthermalent: -775.057446 hartree
zpe.sumelectthermalfe: -775.131821 hartree
dipole: -0.0143 -0.0681 -0.0769
dipole: 0.1037
quadrupole: -108.0276 -113.7723 -122.3659
quadrupole: -0.6402 -0.6358 0.0201
quadrupole: 6.6944 0.9496 -7.6440 -0.6402 -0.6358 0.0201
hfenergy: -775.4543927 hartree
pointgroup: C01 [X(C20H24)]
dipole: 0.0053855 -0.0303939 -0.0266845 debye
polarizability: 403.7282146|1.6566884|149.5142019|-2.2635528|0.3281215|197.814654 unknown
InChI: InChI=1S/C20H24/c1-13-9-15(3)19(16(4)10-13)7-8-20-17(5)11-14(2)12-18(20)6/h7-12H,1-6H3
charge 0 multiplicity 1
44 atoms
C  -1.963319 0.021659 0.228857
C  1.963414 0.021707 -0.219847
C  -2.594627 0.703836 -0.867231
C  2.596038 0.709932 0.871614
C  -2.795618 -0.671894 1.176535
C  2.794128 -0.681777 -1.161575
C  -0.504032 0.029321 0.472214
C  0.503756 0.026242 -0.461146
C  -4.826945 -0.052483 -0.088851
C  4.827668 -0.048918 0.093614
C  -4.004714 0.653814 -0.99577
C  4.006031 0.658305 1.000358
C  -4.195603 -0.703239 0.998913
C  4.19413 -0.71418 -0.984022
C  -1.827399 1.533421 -1.886248
C  1.829654 1.540311 1.890601
C  -2.19441 -1.400223 2.369765
C  2.190425 -1.427768 -2.342527
C  -6.33203 -0.119565 -0.27894
C  6.33847 -0.063778 0.246994
H  -0.212548 -0.037742 1.526951
H  0.211555 -0.048375 -1.515262
H  -4.473202 1.193338 -1.829584
H  4.47478 1.196559 1.834853
H  -4.810357 -1.247988 1.727138
H  4.806981 -1.272328 -1.703636
H  -0.965598 2.052586 -1.431418
H  -1.430697 0.91276 -2.71318
H  -2.491252 2.289776 -2.340482
H  1.433294 0.920537 2.718356
H  2.493619 2.297348 2.3435
H  0.967728 2.059189 1.43565
H  -1.420506 -2.127008 2.061187
H  -2.974758 -1.948934 2.92392
H  -1.714281 -0.700818 3.082461
H  1.707754 -0.739024 -3.063852
H  1.417851 -2.150701 -2.021767
H  2.969866 -1.983374 -2.891079
H  -6.620589 -1.013875 -0.865784
H  -6.860973 -0.180041 0.688925
H  -6.711191 0.764298 -0.821899
H  6.640095 0.052967 1.302932
H  6.774685 -1.005577 -0.130998
H  6.80563 0.764405 -0.321636
