program: Gaussian 09
title: 000277806
version: EM64L-G09RevD.01
frameworkgroup: C1[X(C5H6Br2O2)]
method: RPBEPBE
basis: SDD
operation: Freq
keyword: #p
keyword: freq=noraman
keyword: PBEPBE/SDD
title: #p freq=noraman PBEPBE/SDD
converged: YES YES NO NO
title: Mulliken charges:
elementType: Br Br O O C C C C C H H H H H H
charge: -0.000778 -0.010363 -0.421288 -0.246200 0.585056 -0.806376 -0.825184 -0.368612 0.183083 0.298895 0.309941 0.302754 0.352343 0.260132 0.386597
chargesum: 0.00000
title: Mulliken charges with hydrogens summed into heavy atoms:
elementType: Br Br O O C C C C C
charge: -0.000778 -0.010363 -0.034692 -0.246200 0.585056 -0.197540 -0.170087 -0.108480 0.183083
polarizability: 1.17538326e+02 1.08903359e+01 1.12484585e+02 6.08466536e+00 3.98770107e-01 6.44161667e+01
1716.lowfreq: -7.6749 -0.0004 -0.0003 0.0002 4.4341 11.6256 32.5660 41.2557 58.5975
frequency: 32.5072 41.2476 58.5953 105.4180 149.8729 200.3777 217.6705 324.1766 339.7896 460.0168 478.6202 538.1152 603.8112 632.0760 674.2112 705.4388 837.8411 873.0060 901.1202 916.2554 952.7156 1050.2081 1098.6394 1133.2445 1209.4016 1216.0917 1245.4364 1292.5584 1378.0932 1447.6162 1454.2874 1629.9341 1643.9286 3069.5042 3071.7140 3152.1552 3159.6616 3172.3342 3521.7253
redmass: 14.8430 9.2010 14.9268 6.7541 6.7405 5.0633 3.7236 3.3183 4.0341 6.0343 3.9248 4.0750 1.3035 4.3041 4.2766 3.4689 3.1482 1.7486 1.6139 1.8701 2.7415 2.0557 1.1936 1.1517 1.5290 1.1684 1.2276 2.5600 1.7753 1.1514 1.1224 7.5046 7.4771 1.0571 1.0580 1.0932 1.1094 1.1101 1.0642
irintensity: 1.0334 0.3714 1.3878 2.3639 4.7801 0.7608 3.5924 6.2506 5.2476 29.3649 49.4957 17.3910 100.6557 15.9045 80.4211 16.8979 4.7605 3.2624 21.2516 15.7248 41.4989 414.2312 8.2409 7.8075 6.3262 27.9339 7.4737 47.8169 63.9721 48.7205 3.4811 174.3947 92.5244 6.4204 7.5283 2.5148 2.1151 9.1778 62.9849
temp: 298.150 k
press: 1.00000 atm
elementType: 35 35 8 8 6 6 6 6 6 1 1 1 1 1 1
symmnumber: 1
zpe: 269096.5 jmol-1
zpe.correction: 0.102493 hartree
zpe.thermalcorrener: 0.112759 hartree
zpe.thermalcorrenthalpy: 0.113703 hartree
zpe.thermalcorrgfe: 0.062497 hartree
zpe.sumelectzpe: -370.802168 hartree
zpe.sumelectthermal: -370.791903 hartree
zpe.sumelectthermalent: -370.790959 hartree
zpe.sumelectthermalfe: -370.842164 hartree
dipole: 0.1540 1.8396 1.3194
dipole: 2.2691
quadrupole: -75.2800 -70.2296 -70.5550
quadrupole: 7.4991 0.8575 0.3773
quadrupole: -3.2585 1.7920 1.4665 7.4991 0.8575 0.3773
hfenergy: -370.9046614 hartree
pointgroup: C01 [X(C5H6Br2O2)]
dipole: 0.3021696 -0.6985303 -0.4665795 debye
dipolederiv: -0.5554077 -0.1258727 0.0936046 -0.2157215 -0.1873822 0.0554306 0.2509263 0.0876556 -0.2234076 -0.1257226 0.0232749 -0.0125107 0.0922468 -0.5876321 0.0522166 -0.0207421 0.1588553 -0.1748562 -0.9127761 0.5800265 0.3252195 0.5259952 -0.837278 -0.1659224 0.3027244 -0.1781998 -0.4757959 -0.8289929 -0.0009828 -0.1822853 -0.0478101 -0.6105186 -0.2511973 -0.1684498 -0.2787094 -0.5762383 0.30036 0.0351178 0.0415248 -0.107457 0.2459151 0.0844773 -0.0276041 0.2346073 -0.189209 0.5964913 0.1634481 -0.2718577 0.2181351 0.0998693 -0.1354899 -0.2491779 -0.2045215 0.3075608 -0.0813071 -0.0506151 -0.0235376 -0.1146289 0.5983736 -0.2453781 -0.1069347 -0.246824 0.1784523 -0.8229878 0.1657525 -0.0013293 0.1198492 -0.1523525 0.0867983 -0.10145 0.0368013 -0.0260729 1.8982939 -0.6321512 -0.0057627 -0.2885649 0.9881332 0.47925 0.1581178 0.4326008 0.6832929 0.0164022 -0.0016393 0.1119761 -0.0597789 0.0090332 -0.0474451 0.0407751 -0.0500569 -0.0392854 0.0060814 -0.009382 0.0443172 0.0368442 0.0185506 0.0841775 0.0375526 0.0812966 0.0430462 0.0425946 0.0379293 0.0823139 0.0006114 0.0027851 0.0769857 0.0718763 0.0558885 0.039228 0.1318319 -0.1025916 -0.0524162 0.002542 0.0184506 0.0838912 -0.0293277 0.0437366 0.0668401 0.0622659 0.0038686 -0.0483618 -0.0547361 0.0556667 -0.0794164 -0.0307865 -0.1111384 0.0846689 0.272873 -0.086183 -0.1008947 -0.1075265 0.338386 -0.0783779 -0.1274998 -0.061992 0.3017761 unknown
polarizability: 123.5066128|-6.9162493|104.5395719|-9.2387165|-6.0102873|66.3928927 unknown
InChI: InChI=1S/C5H6Br2O2/c6-2-4(3-7)1-5(8)9/h1,8H,2-3H2
charge 0 multiplicity 1
15 atoms
Br -3.321467 -1.043548 0.648006
Br -0.761397 2.943351 -0.321252
O  2.571996 -1.596066 -0.431796
O  2.172897 0.211439 0.972539
C  -0.705659 0.036803 -0.109614
C  -2.033442 -0.263406 -0.747323
C  -0.632907 1.230204 0.801018
C  0.362713 -0.779803 -0.38757
C  1.736083 -0.624382 0.141056
H  -1.979032 -1.028923 -1.532763
H  -2.550166 0.640728 -1.100633
H  -1.500129 1.293384 1.474362
H  0.322926 1.313506 1.3308
H  0.229634 -1.637911 -1.055252
H  3.494448 -1.484773 -0.074179
