program: Gaussian 09
title: 000277879
version: EM64L-G09RevD.01
frameworkgroup: C1[X(C13H20N2O3S)]
method: RPBEPBE
basis: SDD
operation: Freq
keyword: #p
keyword: freq=noraman
keyword: PBEPBE/SDD
title: #p freq=noraman PBEPBE/SDD
converged: YES YES NO NO
title: Mulliken charges:
elementType: S O O O N N C C C C C C C C C C C C C H H H H H H H H H H H H H H H H H H H H
charge: 0.750962 -0.232288 -0.635329 -0.626248 -0.175682 -0.206510 0.222307 -0.537154 -0.790046 -0.708539 0.257395 -0.159740 -0.794243 -0.236753 -0.185836 0.451806 -0.349275 -0.392133 -0.802185 0.238579 0.280940 0.214408 0.216724 0.308876 0.265163 0.211586 0.252724 0.410996 0.247445 0.300863 0.243744 0.235977 0.287699 0.261813 0.237620 0.237977 0.239541 0.226606 0.230213
chargesum: 0.00000
title: Mulliken charges with hydrogens summed into heavy atoms:
elementType: S O O O N N C C C C C C C C C C C C C
charge: 0.750962 -0.232288 -0.224333 -0.626248 -0.175682 0.040935 0.222307 -0.017635 -0.050039 0.020933 0.257395 -0.159740 -0.013659 0.050946 0.075977 0.451806 -0.111655 -0.154156 -0.105825
polarizability: 2.65197419e+02 -1.43405219e+01 1.97017996e+02 1.95420355e+01 1.61236402e+01 1.26414950e+02
1716.lowfreq: -8.5954 -5.1752 -0.0011 0.0018 0.0019 2.8879 5.4827 16.2974 21.9609
frequency: -7.3262 16.1477 21.9150 34.3861 35.8476 56.7233 69.2805 77.2057 90.7995 105.0239 119.8097 143.1380 169.8168 192.7153 209.1643 227.0662 241.3189 266.7529 295.3818 296.7581 299.4561 304.8628 325.7864 341.5091 359.8830 366.9870 388.1307 404.2538 423.7012 430.8412 476.3632 504.9716 539.0414 568.6804 587.4260 626.2016 638.0104 709.7476 723.8098 761.8929 780.0695 813.4888 816.7676 821.1798 850.4186 870.4071 908.0122 940.3621 954.4829 956.6943 981.2555 984.2995 988.5431 998.6625 1001.6763 1010.1211 1034.3138 1048.1940 1055.0454 1115.8007 1134.7163 1148.5723 1183.4402 1195.9289 1217.7950 1232.4130 1279.2003 1293.8421 1351.6714 1354.8020 1368.9240 1376.1062 1377.7770 1388.3261 1392.1998 1395.9653 1398.0471 1439.6059 1447.4842 1451.7258 1458.4541 1470.7399 1474.5061 1475.7799 1479.8410 1484.9020 1500.1499 1529.3522 1590.6220 1600.6219 1631.2407 2573.0836 2961.7439 2966.4100 2974.9241 2978.9274 2981.8507 2987.7680 3044.3795 3054.8717 3059.7217 3064.0193 3088.9238 3089.1033 3095.0705 3103.5001 3122.7275 3125.7418 3132.5361 3146.3634 3162.5025
redmass: 1.0967 4.2033 3.9662 4.5229 4.6846 3.9051 4.2742 7.7054 5.5480 4.2920 4.4701 4.7035 5.6961 3.8838 1.1060 4.9814 1.0929 7.1738 3.4183 1.3682 1.9177 4.0718 8.6386 2.2555 3.2692 3.4450 2.7925 2.8602 4.8206 2.6216 2.4375 3.0626 3.7404 13.0848 5.7523 6.9197 2.8529 3.3013 4.0606 3.6129 4.7623 2.5258 2.1296 2.5074 1.2529 1.8941 1.8362 1.3997 1.3321 1.5984 1.3485 1.1794 1.4016 4.2432 1.3772 1.6507 1.5699 1.5879 2.5370 1.2828 1.9186 1.8434 1.1434 2.6707 2.9661 2.6458 2.0844 1.2721 1.3723 1.1821 1.2389 1.2870 3.8545 1.2823 3.4795 1.1794 1.2480 1.0642 1.0709 1.0682 1.0526 1.0687 1.0847 2.3755 1.0647 1.0537 1.0490 6.0908 6.8031 6.0950 6.6383 1.0795 1.0394 1.0383 1.0645 1.0382 1.0685 1.0356 1.0941 1.0993 1.0959 1.0946 1.1017 1.0995 1.0960 1.0989 1.1001 1.0878 1.0891 1.0959 1.0962
irintensity: 0.6882 0.2754 0.5646 2.9136 0.7545 3.3531 1.8915 4.9306 1.6460 1.7651 6.7346 5.1209 16.1561 19.4840 0.5084 10.4775 2.5645 8.8896 1.2609 2.2655 1.6268 13.6795 17.1987 4.3688 5.3673 1.0967 4.1466 0.0938 32.4961 8.5283 7.0011 30.8979 6.0170 59.7140 9.3923 0.7245 12.3293 1.1679 4.3913 8.1869 0.7095 48.9196 3.4655 52.6454 8.7384 9.4367 24.5321 8.2123 1.8358 43.9176 4.6874 157.4615 1.9325 4.8882 32.2300 19.4923 4.2349 18.6725 16.7681 10.3870 11.8354 12.7393 10.5520 56.1692 4.3071 7.1798 7.1197 1.6040 9.2428 99.8422 52.5253 56.5866 4.3601 58.9875 6.8304 32.6102 14.5069 19.8757 8.6485 38.4520 3.8925 14.4330 13.9288 21.9102 17.6175 7.4200 14.1389 14.0504 0.4718 9.9173 115.5668 2717.2829 12.6562 25.7079 21.7597 29.7878 23.6359 25.4962 11.9894 28.7647 20.5713 6.8787 8.9522 17.2724 1.1410 4.0808 13.5225 10.3314 12.1975 13.6507 6.1718
temp: 298.150 k
press: 1.00000 atm
elementType: 16 8 8 8 7 7 6 6 6 6 6 6 6 6 6 6 6 6 6 1 1 1 1 1 1 1 1 1 1 1 1 1 1 1 1 1 1 1 1
symmnumber: 1
zpe: 808792.4 jmol-1
zpe.correction: 0.308053 hartree
zpe.thermalcorrener: 0.330015 hartree
zpe.thermalcorrenthalpy: 0.330960 hartree
zpe.thermalcorrgfe: 0.254369 hartree
zpe.sumelectzpe: -1239.019809 hartree
zpe.sumelectthermal: -1238.997846 hartree
zpe.sumelectthermalent: -1238.996902 hartree
zpe.sumelectthermalfe: -1239.073493 hartree
dipole: -1.8647 -0.9160 -1.1518
dipole: 2.3755
quadrupole: -98.5962 -125.7125 -122.4651
quadrupole: -14.0470 0.2098 -4.8373
quadrupole: 16.9950 -10.1212 -6.8738 -14.0470 0.2098 -4.8373
hfenergy: -1239.3278619 hartree
pointgroup: C01 [X(C13H20N2O3S1)]
dipole: 0.7640983 0.5379465 0.0146318 debye
polarizability: 253.9725216|17.8031216|146.1126931|-35.9399203|33.1966554|188.5451509 unknown
InChI: InChI=1S/C7H8O2S.C6H12N2O/c1-6-2-4-7(5-3-6)10(8)9;1-5(9)4-6(2,3)8-7/h2-5,8H,1H3;7H,4H2,1-3H3
charge 0 multiplicity 1
39 atoms
S  0.760562 -0.685921 1.165461
O  -4.651535 -0.409399 -1.114549
O  0.251155 1.063832 1.401987
O  -0.167551 -1.377238 -0.025857
N  -2.272482 1.210999 2.300137
N  -2.568064 2.00121 3.256724
C  -3.338877 0.546133 1.401503
C  -2.847218 0.870425 -0.042718
C  -4.766116 1.055262 1.665101
C  -3.209583 -0.971248 1.712302
C  -3.455061 -0.009283 -1.149496
C  2.339776 -0.208868 0.257102
C  -2.50635 -0.370577 -2.274578
C  2.547214 -0.77362 -1.012452
C  3.272378 0.654075 0.859632
C  4.711146 0.403408 -1.129882
C  3.739095 -0.461286 -1.700275
C  4.459216 0.9553 0.153746
C  5.97924 0.747213 -1.891003
H  -3.090211 1.926854 -0.284169
H  -1.748407 0.778259 -0.090314
H  -4.853084 2.153547 1.547513
H  -5.141921 0.768227 2.666291
H  -5.422067 0.588907 0.911503
H  -2.222596 -1.360519 1.406707
H  -3.363258 -1.164673 2.788929
H  -3.983227 -1.516992 1.146877
H  -0.688361 1.071803 1.875245
H  -3.619674 2.156055 3.353707
H  -1.67149 -0.964917 -1.84989
H  -3.027591 -0.936597 -3.061593
H  -2.046988 0.540866 -2.70379
H  1.777211 -1.424507 -1.442787
H  3.071027 1.104384 1.836619
H  3.918029 -0.893987 -2.691911
H  5.194618 1.631383 0.605049
H  5.770513 1.477163 -2.69677
H  6.742727 1.192334 -1.230403
H  6.419107 -0.146811 -2.3684
