program: Gaussian 09
title: 000277787
version: EM64L-G09RevD.01
frameworkgroup: C1[X(C13H10O3)]
method: RPBEPBE
basis: SDD
operation: Freq
keyword: #pfreq=noraman
keyword: PBEPBE/SDD
title: #p freq=noraman PBEPBE/SDD
converged: YES YES NO NO
title: Mulliken charges:
elementType: O O O C C C C C C C C C C C C C H H H H H H H H H H
charge: -0.218885 -0.391912 -0.239457 0.197201 0.188217 0.398225 -0.341663 -0.371632 -0.434120 0.130545 -0.427252 -0.289002 -0.610259 -0.244246 -0.242235 0.211636 0.277096 0.308225 0.244398 0.240321 0.238324 0.254331 0.276881 0.231855 0.232241 0.381167
chargesum: 0.00000
title: Mulliken charges with hydrogens summed into heavy atoms:
elementType: O O O C C C C C C C C C C C C C
charge: -0.218885 -0.010745 -0.239457 0.197201 0.188217 0.398225 -0.064567 -0.063408 -0.189722 0.130545 -0.186930 -0.050678 -0.079047 -0.012391 -0.009994 0.211636
polarizability: 2.16281132e+02 7.95866627e+00 1.75475515e+02 9.46716553e+00 8.30940803e-01 7.29891470e+01
1716.lowfreq: -11.0901 -4.1778 -0.0003 0.0002 0.0005 3.7115 12.1883 34.7697 69.8574
frequency: 11.0420 34.7544 69.8281 91.3396 137.0114 183.3307 199.6326 213.6242 302.4361 357.9930 395.0564 418.0644 445.1830 471.8332 489.2248 501.6343 518.5602 551.8128 560.7677 604.1803 633.9919 667.1744 674.3375 735.1380 754.9903 785.5121 788.9402 824.0251 834.4675 871.5526 897.0600 921.8330 942.0882 958.4017 978.4716 998.7701 1013.2166 1031.3524 1049.0508 1089.7703 1101.7989 1151.0141 1173.2468 1177.9197 1207.1012 1238.9320 1248.8706 1262.5978 1281.1564 1327.5238 1374.1628 1402.0961 1410.9914 1437.0305 1449.6786 1461.9625 1514.8939 1569.1912 1581.4993 1597.0395 1627.8058 1645.5866 3054.1096 3123.3474 3127.5229 3130.9659 3137.7956 3153.4486 3159.9820 3171.1967 3194.8203 3509.0495
redmass: 7.8120 9.5131 5.7643 5.5203 7.0294 4.3127 5.3189 4.2856 6.3956 6.6983 3.5879 2.6170 4.6611 3.2608 4.6762 3.4143 5.0470 5.8969 3.2178 2.6949 1.9957 2.9804 4.5811 3.7735 1.4904 2.7858 2.9432 1.8951 3.7054 4.0991 1.7494 3.2175 1.5385 2.4938 1.3883 1.4080 1.3303 2.5296 2.0796 2.7934 2.3982 1.4169 1.2946 1.0948 1.4610 1.8300 1.7437 1.4164 1.9331 2.1424 2.4639 3.2503 4.6044 2.2731 1.3255 1.6556 3.7827 8.2286 6.3181 5.4105 6.4227 8.2554 1.0581 1.0870 1.0880 1.1051 1.0910 1.0922 1.0986 1.0973 1.0945 1.0640
irintensity: 2.3020 0.6342 2.5026 1.4229 0.7829 1.6505 6.0173 0.7552 0.5754 0.5685 0.6072 5.5077 3.7736 0.6799 23.4210 11.5837 10.7975 5.6222 26.7168 97.9715 90.6457 30.9268 5.8573 2.3642 1.2930 38.6501 34.1722 66.1692 9.1592 13.4507 3.5580 54.4869 18.0312 16.7764 2.3517 3.2335 2.5015 9.0378 117.6117 155.0756 127.7700 50.1882 51.1231 5.2931 28.2284 6.3795 141.8833 30.6535 49.8411 45.1252 2.7899 7.9868 3.2822 8.5612 12.4620 19.7590 68.9013 229.0903 20.6693 12.4275 23.7548 147.2650 2.5475 0.5330 4.6817 1.4256 20.1083 16.2703 29.3217 10.9379 14.4362 34.7862
temp: 298.150 k
press: 1.00000 atm
elementType: 8 8 8 6 6 6 6 6 6 6 6 6 6 6 6 6 1 1 1 1 1 1 1 1 1 1
symmnumber: 1
zpe: 514464.8 jmol-1
zpe.correction: 0.195949 hartree
zpe.thermalcorrener: 0.209120 hartree
zpe.thermalcorrenthalpy: 0.210064 hartree
zpe.thermalcorrgfe: 0.153789 hartree
zpe.sumelectzpe: -725.954432 hartree
zpe.sumelectthermal: -725.941262 hartree
zpe.sumelectthermalent: -725.940318 hartree
zpe.sumelectthermalfe: -725.996593 hartree
dipole: -1.2036 1.8217 0.1750
dipole: 2.1905
quadrupole: -76.2174 -93.2224 -91.1477
quadrupole: -2.1978 0.5325 1.6492
quadrupole: 10.6451 -6.3599 -4.2852 -2.1978 0.5325 1.6492
hfenergy: -726.1503816 hartree
pointgroup: C01 [X(C13H10O3)]
dipole: -0.5439429 0.640551 0.1910607 debye
dipolederiv: -0.6644448 0.0403074 -0.0389444 0.2443116 -0.9514321 -0.063986 -0.061181 -0.1864638 -0.3107947 -0.8701484 0.2914334 0.2509013 0.3754805 -0.4330871 -0.2721482 0.5135534 -0.2951339 -0.6375898 -0.6083373 -0.1062351 0.1181547 -0.0965449 -0.9495195 -0.0872174 0.311458 0.106884 -0.4434064 0.0850919 -0.0414684 -0.0088702 0.4217285 0.0593256 0.0604925 0.1221514 -0.0127115 0.0324749 -0.6798349 0.3025501 -0.0152756 0.5162437 -0.3609783 -0.0105094 -0.0569821 -0.0195457 -0.0313353 -0.0061527 0.1239674 0.0164341 -0.0356985 -0.2309271 -0.0694415 -0.0193208 -0.039862 0.0426434 0.1656812 -0.0660985 0.0323086 -0.452229 0.0658015 -0.0279508 -0.1045701 0.0082513 -0.1087207 -0.2427018 -0.0818876 -0.0287166 -0.1929742 -0.0415815 -0.0031423 -0.064506 0.0136605 -0.1403896 0.2776121 -0.0733418 0.0542179 0.1776319 0.1432305 0.0833684 0.118094 0.0475519 -0.1029647 1.8580188 -0.1726005 0.14697 -0.457714 1.0532965 0.1325817 0.3915701 0.270589 0.1569299 0.0692224 -0.0287713 0.0377296 -0.1379269 0.063236 0.0296403 0.0161554 0.0471179 -0.1623593 -0.5421381 0.0564839 -0.0349278 0.0454028 0.1351132 0.0743124 -0.0560444 0.0594012 -0.1624611 -0.8683163 -0.288352 0.0657243 -0.4294619 -0.1569135 0.0912305 0.0834551 0.0675761 -0.0572912 0.0258115 -0.0387073 0.018004 -0.0337381 0.1979534 0.0699194 0.0225001 0.0732514 -0.1315479 0.1405278 0.0227911 0.0581605 0.0403537 -0.1512916 0.0046215 0.0604693 0.003932 -0.1376127 1.0688911 -0.0544271 -0.5863554 0.0181939 1.2577411 0.1519264 -1.1921059 -0.0119623 0.7776237 0.0827151 -0.0301422 -0.054843 -0.0300292 0.099593 -0.0119781 -0.0672739 0.0076172 0.1318803 0.1558911 0.0914617 0.0107705 0.018024 0.0810704 -0.0168703 0.0015422 -0.006325 0.1596645 -0.025384 0.1254358 -0.001977 0.0617293 0.0139042 -0.0180498 -0.0200325 -0.0043689 0.1441559 -0.0117374 0.0590236 -0.0159095 0.1339874 -0.0171214 -0.0144345 -0.0008938 -0.0262946 0.1492244 0.0755127 -0.0444627 -0.0233641 -0.0154013 -0.0887347 -0.0595273 -0.0171565 -0.057731 0.1438595 0.101049 0.0235377 0.0434543 -0.0190944 0.0423471 -0.0969187 0.0543398 -0.0357573 0.0084717 0.0651278 0.0367509 -0.024637 0.0612178 0.0187981 0.0357802 0.0061164 0.0063611 0.0989472 0.0716773 -0.0406185 -0.0227764 -0.0581262 -0.0977685 -0.0637723 -0.0265038 -0.0629156 0.1358314 -0.1165006 -0.0563165 -0.060279 -0.056132 0.0824288 -0.0270448 -0.0621604 -0.02833 0.144033 0.3928669 -0.0503138 0.064046 -0.0992344 0.165516 0.1091179 0.0473259 0.0752079 0.3007338 unknown
polarizability: 213.8843905|9.1569716|172.4736175|14.1646113|22.3228248|78.3877852 unknown
InChI: InChI=1S/C13H10O3/c14-12(8-13(15)16)11-7-3-5-9-4-1-2-6-10(9)11/h1-7,15H,8H2
charge 0 multiplicity 1
26 atoms
O  1.266401 -2.157515 0.050882
O  4.267045 -0.427619 -0.771867
O  3.50291 1.62262 0.000881
C  -1.195197 -0.449427 0.09879
C  0.156655 -0.020372 0.448565
C  -2.258254 0.542843 0.122413
C  0.383681 1.332642 0.782964
C  -1.549946 -1.794333 -0.258919
C  -1.965127 1.901773 0.467877
C  1.319152 -0.961557 0.458836
C  -3.60243 0.162728 -0.202638
C  -0.665101 2.292364 0.788869
C  2.688374 -0.476281 1.042179
C  -2.871857 -2.132859 -0.569851
C  -3.910737 -1.153811 -0.54436
C  3.495255 0.371479 0.07454
H  1.39399 1.680599 1.014709
H  -0.764748 -2.55036 -0.294034
H  -2.783414 2.63202 0.474526
H  -4.384971 0.930452 -0.176679
H  -0.441341 3.333034 1.043442
H  2.538283 0.10175 1.967295
H  3.253017 -1.395117 1.259458
H  -3.111993 -3.167474 -0.839295
H  -4.939084 -1.438314 -0.791808
H  4.757436 0.151233 -1.417474
