program: Gaussian 09
title: 000277786
version: EM64L-G09RevD.01
frameworkgroup: C1[X(C14H12O3)]
method: RPBEPBE
basis: SDD
operation: Freq
keyword: #pfreq=noraman
keyword: PBEPBE/SDD
title: #p freq=noraman PBEPBE/SDD
converged: YES YES NO NO
title: Mulliken charges:
elementType: O O O C C C C C C C C C C C C C C H H H H H H H H H H H H
charge: -0.209129 -0.415444 -0.237244 0.195249 0.244742 0.390399 -0.537147 0.064011 -0.388795 -0.479315 -0.369438 -0.438367 -0.432174 -0.238271 -0.263042 -0.242793 0.186386 0.279218 0.269912 0.267994 0.250966 0.295792 0.241362 0.243631 0.240966 0.236652 0.232272 0.233550 0.378056
chargesum: 0.00000
title: Mulliken charges with hydrogens summed into heavy atoms:
elementType: O O O C C C C C C C C C C C C C C
charge: -0.209129 -0.037388 -0.237244 0.195249 0.244742 0.390399 0.011983 0.064011 -0.120800 0.067443 -0.128077 -0.194736 -0.191207 -0.001619 -0.030770 -0.009243 0.186386
polarizability: 2.03478304e+02 2.87782633e+00 1.90052889e+02 1.93973624e+01 -6.95797926e+00 9.39084015e+01
1716.lowfreq: -10.8515 -6.2266 -3.8472 0.0007 0.0008 0.0009 14.7295 31.8343 42.3933
frequency: 14.4139 31.8109 42.3691 79.0791 86.8284 135.6470 172.1581 186.9790 210.0669 237.9348 306.6689 334.1306 392.1748 421.1861 456.5968 469.0388 498.9268 509.7823 523.4903 554.1377 572.0249 602.7960 646.4389 649.4663 666.4673 738.0024 751.4902 781.4467 786.8464 791.1925 819.5132 833.0175 881.7763 898.2106 932.5731 959.3725 969.3880 990.2396 997.1524 1003.3837 1024.7378 1038.0874 1064.3915 1082.6112 1104.5315 1150.1641 1159.9131 1177.8180 1189.1489 1230.5035 1237.7131 1243.3384 1254.4467 1280.9342 1327.9275 1367.9170 1370.4272 1402.2492 1410.9469 1438.8089 1440.7011 1451.0449 1459.2081 1515.8567 1565.8704 1587.6031 1594.3512 1629.5983 1664.2950 2980.2104 2991.3323 3060.3251 3086.1009 3125.4692 3128.4103 3135.7002 3146.9030 3152.2688 3165.5598 3167.2289 3511.8217
redmass: 5.7315 10.0832 5.6655 3.1912 4.4451 5.5600 3.8690 4.6189 4.4835 4.4204 4.7940 6.3780 4.0493 3.7623 3.5539 3.2655 4.2937 2.5057 5.1665 3.1960 3.6429 3.1892 1.9271 2.9378 3.1089 3.9801 1.4079 2.3322 1.8901 2.9977 1.7247 3.9147 1.6675 4.1786 1.5208 2.4871 1.7892 1.3907 1.3806 2.1344 3.0895 2.7621 2.3907 2.2676 2.1890 1.3754 1.2667 1.0992 1.2944 1.3733 1.9064 1.4616 1.5506 1.8163 1.7389 2.2102 2.3147 2.6520 6.2544 2.0170 1.1863 2.3657 1.1143 3.7191 7.5946 7.1896 5.9381 6.4831 8.2204 1.0679 1.0641 1.0937 1.0930 1.0866 1.0873 1.0883 1.0913 1.0944 1.0991 1.1001 1.0639
irintensity: 0.3711 1.1342 0.9846 2.4330 2.3201 4.9321 1.0806 1.8998 3.7652 2.4858 3.6033 6.3558 0.9234 15.5350 18.9587 0.0239 8.3756 69.3348 7.2676 7.0527 22.8919 10.8199 55.6077 55.6339 11.6118 6.3909 4.7118 6.1198 73.9608 5.2109 59.3588 2.0056 6.2325 1.3404 1.3726 2.2956 7.5449 2.6716 1.0963 25.6306 40.1139 90.2649 128.9690 80.3973 14.0718 7.8633 2.9952 3.4383 10.7867 5.7529 5.4044 130.3667 0.1036 6.5028 142.3613 35.5207 0.8466 3.2830 1.6214 1.0871 21.1843 11.8076 42.5207 19.6604 140.5067 8.3389 35.9302 0.9514 204.2324 5.8731 35.3677 7.2513 11.4990 1.0436 3.5308 3.6129 8.0171 34.4820 30.8992 13.0654 24.5946
temp: 298.150 k
press: 1.00000 atm
elementType: 8 8 8 6 6 6 6 6 6 6 6 6 6 6 6 6 6 1 1 1 1 1 1 1 1 1 1 1 1
symmnumber: 1
zpe: 586473.4 jmol-1
zpe.correction: 0.223376 hartree
zpe.thermalcorrener: 0.238071 hartree
zpe.thermalcorrenthalpy: 0.239015 hartree
zpe.thermalcorrgfe: 0.178885 hartree
zpe.sumelectzpe: -765.178800 hartree
zpe.sumelectthermal: -765.164105 hartree
zpe.sumelectthermalent: -765.163161 hartree
zpe.sumelectthermalfe: -765.223291 hartree
dipole: 2.1937 2.3387 0.6046
dipole: 3.2630
quadrupole: -82.1160 -91.6564 -109.6967
quadrupole: -5.9708 5.5086 -5.1094
quadrupole: 12.3737 2.8333 -15.2070 -5.9708 5.5086 -5.1094
hfenergy: -765.4021757 hartree
pointgroup: C01 [X(C14H12O3)]
dipole: 0.9054736 0.8442261 0.3397984 debye
polarizability: 202.9849981|0.2239938|190.4190164|21.1934309|1.5475201|94.0355792 unknown
InChI: InChI=1S/C14H12O3/c15-13(8-9-14(16)17)12-7-3-5-10-4-1-2-6-11(10)12/h1-7,16H,8-9H2
charge 0 multiplicity 1
29 atoms
O  -1.381152 -1.899318 -1.459107
O  -5.209156 1.334473 -0.261009
O  -4.443552 0.139956 1.575877
C  1.344384 0.091987 -0.068804
C  0.558655 -1.107153 -0.269393
C  2.729221 -0.050471 0.344676
C  -1.870126 -0.279721 0.280716
C  -0.91323 -1.110344 -0.58559
C  1.165226 -2.369192 -0.145794
C  -3.105346 0.192847 -0.50723
C  0.851992 1.416589 -0.32758
C  3.288289 -1.359588 0.514225
C  3.529871 1.122354 0.548354
C  2.526237 -2.500133 0.254594
C  1.659076 2.539758 -0.131491
C  3.006096 2.396266 0.326384
C  -4.271411 0.525416 0.397996
H  -2.21175 -0.957438 1.091787
H  -1.356185 0.550984 0.788931
H  0.560467 -3.260617 -0.342236
H  -2.887037 1.06382 -1.150039
H  -3.420285 -0.622711 -1.189692
H  -0.159493 1.551228 -0.723644
H  4.332562 -1.450006 0.836202
H  4.570957 0.99868 0.869533
H  2.963275 -3.497635 0.36692
H  1.262814 3.53922 -0.341101
H  3.625869 3.285675 0.481858
H  -5.981873 1.498573 0.345656
