program: Gaussian 09
title: 000277755
version: EM64L-G09RevD.01
frameworkgroup: C1[X(C14H14N2O2)]
method: RPBEPBE
basis: SDD
operation: Freq
keyword: #p
keyword: freq=noraman
keyword: PBEPBE/SDD
title: #p freq=noraman PBEPBE/SDD
converged: YES YES NO NO
title: Mulliken charges:
elementType: O O N N C C C C C C C C C C C C C C H H H H H H H H H H H H H H
charge: -0.307898 -0.302936 -0.181031 0.027211 -0.473065 0.293915 -0.406365 -0.178501 -0.440739 0.437694 -0.055177 0.304234 -0.405407 -0.324944 -0.247574 -0.225208 -0.211051 -0.675026 0.256402 0.256370 0.259052 0.259083 0.257054 0.236107 0.265786 0.231464 0.233741 0.224849 0.224826 0.210510 0.228314 0.228308
chargesum: 0.00000
title: Mulliken charges with hydrogens summed into heavy atoms:
elementType: O O N N C C C C C C C C C C C C C C
charge: -0.307898 -0.302936 -0.181031 0.027211 0.039707 0.293915 0.111770 -0.178501 -0.183685 0.437694 -0.055177 0.304234 -0.169300 -0.059158 -0.016109 0.008533 0.238625 -0.007894
polarizability: 2.80723683e+02 -8.25695006e+00 1.66981670e+02 2.58035708e-02 2.62362409e-02 8.27733894e+01
1716.lowfreq: -8.1544 -7.0443 -0.0009 -0.0007 -0.0005 2.6188 24.3207 33.2715 67.6702
frequency: 23.9141 33.1928 67.6691 82.3154 103.1307 132.0844 153.9886 181.3834 209.1886 245.5877 262.2471 265.2301 278.9587 290.4005 348.1753 398.4167 414.7619 478.9285 480.3627 531.3189 535.5604 583.8800 613.5504 667.3409 697.9390 703.0912 719.0286 747.1730 766.6012 797.0203 800.6805 814.0153 824.2278 863.6551 877.0410 891.3058 911.3299 968.6750 992.0598 997.1459 1016.3995 1016.5544 1018.6256 1059.8198 1097.5845 1111.3572 1138.0409 1139.4468 1156.5398 1167.3650 1168.7255 1170.8011 1212.6133 1237.4370 1247.1800 1259.1788 1280.9356 1301.5043 1325.5844 1337.6708 1388.5557 1394.1708 1400.0589 1406.2031 1417.1143 1461.4094 1462.5127 1475.1122 1477.4129 1484.3240 1490.6649 1502.8178 1561.7146 1622.5874 1631.2927 1645.6961 2974.5904 2992.1306 2994.5191 3008.0991 3015.6794 3038.2577 3065.6584 3091.5710 3105.7827 3121.4602 3129.4328 3138.2085 3156.1433 3170.9805
redmass: 3.9649 2.3732 4.1812 4.6888 3.7022 3.3559 3.3632 4.9786 2.8880 1.2783 5.6959 3.1733 6.0699 3.5115 3.8689 3.6822 4.6416 5.5047 2.9070 7.1894 3.2831 5.3528 6.9624 3.3926 10.6525 8.3793 5.7100 6.1001 1.2719 2.7679 1.0957 4.4799 3.9936 3.6792 1.4624 5.7170 1.5860 1.3869 1.6423 1.3343 2.3717 1.9005 2.2407 6.1256 2.5226 2.2086 1.4546 2.2066 1.0987 1.5599 1.8969 1.0757 1.6917 2.4606 1.1340 2.7941 1.9944 1.8838 1.9000 1.7643 1.8932 3.2593 1.8470 2.8781 4.5277 1.0410 3.0661 1.1169 1.0621 1.1003 1.0830 3.7639 8.2610 6.6008 7.9482 11.4011 1.0584 1.0587 1.0358 1.0580 1.1039 1.1042 1.1067 1.0985 1.1026 1.0876 1.0929 1.0889 1.0947 1.0996
irintensity: 0.1944 0.0731 0.6965 3.5131 0.3878 12.3562 0.0099 3.4339 6.3802 0.0952 3.1927 1.5001 8.7834 1.9555 10.1926 0.0008 2.3728 3.7725 8.2811 2.6518 0.1530 7.7365 1.1962 0.2175 22.0113 2.3436 3.2281 0.7951 71.6041 6.6013 3.5847 7.0610 0.3446 30.1564 12.8218 0.0048 15.1465 4.6638 4.1912 0.0446 5.1753 1.0562 3.7088 381.8689 6.2215 3.0110 4.6578 11.5251 0.9130 2.5168 12.9729 0.1994 0.1173 3.6858 0.0137 16.8485 197.5127 29.7435 19.0210 126.4612 225.9771 14.0149 20.4331 37.9398 12.8895 12.2281 8.6958 20.2310 3.0945 23.4124 12.0990 14.1950 3.0039 1.7062 80.1297 436.2435 28.1441 12.4306 23.8663 30.8623 12.9686 14.0942 9.6738 36.3197 48.0613 3.0833 9.1175 11.0523 22.9848 23.8566
temp: 298.150 k
press: 1.00000 atm
elementType: 8 8 7 7 6 6 6 6 6 6 6 6 6 6 6 6 6 6 1 1 1 1 1 1 1 1 1 1 1 1 1 1
symmnumber: 1
zpe: 664167.3 jmol-1
zpe.correction: 0.252968 hartree
zpe.thermalcorrener: 0.268562 hartree
zpe.thermalcorrenthalpy: 0.269507 hartree
zpe.thermalcorrgfe: 0.208558 hartree
zpe.sumelectzpe: -800.577523 hartree
zpe.sumelectthermal: -800.561929 hartree
zpe.sumelectthermalent: -800.560985 hartree
zpe.sumelectthermalfe: -800.621933 hartree
dipole: 1.9573 -0.0642 0.0014
dipole: 1.9583
quadrupole: -86.7368 -104.4335 -106.7383
quadrupole: 13.7526 0.0017 -0.0001
quadrupole: 12.5660 -5.1306 -7.4354 13.7526 0.0017 -0.0001
hfenergy: -800.8304914 hartree
pointgroup: C01 [X(C14H14N2O2)]
dipole: -0.770372 -0.0121627 -0.0005505 debye
polarizability: 280.9718458|6.3157828|166.7335069|0.0253531|-0.0266718|82.7733894 unknown
InChI: InChI=1S/C14H14N2O2/c1-2-18-14(17)16-8-11-7-10-5-3-4-6-12(10)15-13(11)9-16/h3-7H,2,8-9H2,1H3
charge 0 multiplicity 1
32 atoms
O  3.946435 -0.557043 0.000559
O  3.844886 1.805149 -0.000183
N  1.91371 0.4875 0.001312
N  -1.239772 -1.313009 0.000923
C  0.992571 1.655111 0.000394
C  -0.368369 0.995517 0.000184
C  1.235006 -0.831105 0.001642
C  -0.229361 -0.436588 0.000897
C  -1.643872 1.546553 -0.00055
C  -2.773412 0.65792 -0.000565
C  -2.526428 -0.774316 0.00019
C  3.270933 0.680555 0.001606
C  -4.125967 1.128062 -0.001294
C  -3.637036 -1.674752 0.000184
C  -5.19243 0.225285 -0.001281
C  -4.946007 -1.184657 -0.000537
C  5.43365 -0.455725 -0.001259
C  5.967429 -1.885016 -0.002013
H  1.167327 2.290777 -0.889463
H  1.166663 2.291585 0.889805
H  1.503931 -1.429665 0.892002
H  1.504606 -1.430507 -0.887945
H  -1.806897 2.630812 -0.001112
H  -4.313422 2.208798 -0.001864
H  -3.42011 -2.747316 0.00076
H  -6.22411 0.593421 -0.001841
H  -5.792117 -1.880403 -0.000537
H  5.747296 0.112176 -0.895977
H  5.749441 0.112043 0.892788
H  7.072707 -1.871209 -0.00334
H  5.627535 -2.433243 0.893353
H  5.625382 -2.433109 -0.896641
