program: Gaussian 09
title: 000277770
version: EM64L-G09RevD.01
frameworkgroup: C1[X(C12H12N2O4S2)]
method: RPBEPBE
basis: SDD
operation: Freq
keyword: #p
keyword: freq=noraman
keyword: PBEPBE/SDD
title: #p freq=noraman PBEPBE/SDD
converged: YES YES NO NO
title: Mulliken charges:
elementType: S S O O O O N N C C C C C C C C C C C C H H H H H H H H H H H H
charge: 0.023299 -0.014847 -0.313981 -0.278615 -0.167951 -0.161464 -0.360491 -0.383643 0.186462 0.122691 -0.371752 -0.347812 0.154520 0.127812 -0.224077 -0.227320 -0.316637 -0.389176 -0.168038 -0.091249 0.254010 0.278996 0.237971 0.238883 0.361483 0.374330 0.316153 0.281117 0.299871 0.264562 0.152472 0.142417
chargesum: 0.00000
title: Mulliken charges with hydrogens summed into heavy atoms:
elementType: S S O O O O N N C C C C C C C C C C C C
charge: 0.175772 0.127571 -0.313981 -0.278615 -0.167951 -0.161464 0.000992 -0.009312 0.186462 0.122691 -0.117741 -0.068816 0.154520 0.127812 0.013894 0.011563 0.280633 0.175257 -0.168038 -0.091249
polarizability: 2.35586481e+02 -2.66882070e+01 2.29385475e+02 -1.52509284e+01 1.19448223e+01 1.14137424e+02
1716.lowfreq: -5.3608 -1.2295 -0.0019 0.0005 0.0020 4.3653 13.0788 24.7375 35.3788
frequency: 12.9982 24.7296 35.3772 36.7300 52.5826 58.9332 63.8516 79.3937 115.0323 138.2930 168.1461 175.8715 195.6847 235.1687 241.4635 272.6580 299.9854 317.2250 322.5514 328.5211 353.9156 386.0912 400.3698 410.6711 425.6626 443.3338 481.0108 482.7679 510.6970 565.7813 638.6274 656.5795 669.5926 692.7542 712.8539 731.5632 745.8873 776.6039 778.6440 792.3169 803.7922 813.4210 862.0202 891.7652 900.1662 961.5906 969.6315 973.8554 999.6130 1002.2533 1014.0029 1037.3689 1061.9134 1085.5035 1114.2929 1161.9173 1176.4673 1179.2028 1206.6035 1237.1742 1260.5427 1269.9697 1295.9429 1322.9671 1340.6275 1367.9679 1423.7416 1427.2906 1454.6543 1466.0637 1494.5192 1542.8403 1556.5108 1571.7009 1602.0625 1612.3533 1637.8661 1653.6523 2449.4020 2455.6669 2982.0002 2986.4447 3034.6340 3043.7744 3131.2199 3143.9192 3159.6506 3173.1749 3272.3300 3506.6864
redmass: 10.1513 8.1419 10.7533 13.0406 6.6335 5.5780 6.0403 7.6686 5.1268 5.4215 4.5178 6.1980 5.9488 5.5188 5.1358 5.5372 5.7019 1.5141 1.1038 2.4799 5.1196 4.0468 6.5571 7.9678 8.4606 4.6575 3.7194 3.0480 5.2814 3.9643 6.3764 1.3620 3.4160 4.8477 4.9015 6.7584 5.2664 2.1058 1.3805 2.2522 1.8408 1.9683 1.3758 2.6990 1.8203 1.9272 1.6131 2.2567 2.9596 1.3597 3.3027 2.8339 3.8699 2.8723 2.5477 2.6824 2.0995 1.2428 1.0883 1.1453 1.6018 1.5523 2.4013 1.4730 1.8237 9.3998 1.9645 1.1542 1.1358 2.1492 2.8029 2.8617 8.2554 4.2928 3.8290 3.9330 8.4151 9.1523 1.0380 1.0381 1.0626 1.0591 1.0970 1.1005 1.0867 1.0900 1.0945 1.0998 1.0861 1.0783
irintensity: 0.6697 0.2669 0.5934 0.0679 1.8279 4.3668 4.5810 4.2086 1.3255 4.3930 2.3033 9.0325 6.2575 13.2291 7.0386 3.3917 22.8045 20.0500 41.8926 18.0542 33.7530 26.7177 4.1083 2.2714 2.0888 43.3730 9.3937 0.0324 31.2422 31.0592 4.6132 79.8998 33.4763 25.9745 20.5481 57.2693 41.7464 39.1110 41.9844 16.7342 30.4676 48.4701 162.4426 21.2369 3.5364 0.1173 9.0521 10.6198 151.3576 0.1661 130.2940 17.3726 29.0797 41.3077 9.1494 12.5078 1.8179 0.2255 3.4550 51.9832 6.5980 18.0342 94.3479 33.4293 58.4533 11.1376 6.5049 50.2519 30.9582 77.6250 305.5643 448.7320 133.3957 4.2356 55.5859 55.0422 135.6336 217.9136 3.7789 6.4067 40.9372 65.7046 2.4110 4.1602 1.1075 9.7003 10.0310 20.5957 365.6337 93.0621
temp: 298.150 k
press: 1.00000 atm
elementType: 16 16 8 8 8 8 7 7 6 6 6 6 6 6 6 6 6 6 6 6 1 1 1 1 1 1 1 1 1 1 1 1
symmnumber: 1
zpe: 585713.5 jmol-1
zpe.correction: 0.223086 hartree
zpe.thermalcorrener: 0.243543 hartree
zpe.thermalcorrenthalpy: 0.244487 hartree
zpe.thermalcorrgfe: 0.169781 hartree
zpe.sumelectzpe: -1669.567017 hartree
zpe.sumelectthermal: -1669.546561 hartree
zpe.sumelectthermalent: -1669.545617 hartree
zpe.sumelectthermalfe: -1669.620323 hartree
dipole: -2.1425 -2.4143 0.9116
dipole: 3.3541
quadrupole: -117.1836 -119.0274 -141.4445
quadrupole: -8.9550 4.9866 1.5992
quadrupole: 8.7016 6.8578 -15.5593 -8.9550 4.9866 1.5992
hfenergy: -1669.790104 hartree
pointgroup: C01 [X(C12H12N2O4S2)]
dipole: 0.1203685 -1.299602 -0.1948131 debye
polarizability: 255.4484202|2.1732546|204.3536772|-29.2768155|-13.2068045|119.3072829 unknown
InChI: InChI=1S/C12H12N2O4S2/c15-9(19)5-13-11(17)7-3-1-2-4-8(7)12(18)14-6-10(16)20/h1-4,13-14,19-20H,5-6H2
charge 0 multiplicity 1
32 atoms
S  3.758435 -3.92129 0.380846
S  3.865383 3.483243 -0.575446
O  0.114936 -0.462962 -1.811309
O  -1.093421 3.041847 0.978104
O  1.41957 -3.566527 1.77544
O  2.52047 1.153336 0.019686
N  0.24054 -1.810366 0.05835
N  -0.020995 2.091859 -0.854875
C  -1.73604 -0.397664 -0.195552
C  -2.011497 0.96984 0.118804
C  -2.756445 -1.371268 -0.032271
C  -3.30333 1.310935 0.595871
C  -0.401061 -0.878691 -0.714876
C  -1.003617 2.105283 0.118015
C  -4.044461 -1.007602 0.412871
C  -4.317972 0.342397 0.728997
C  1.590832 -2.256505 -0.286737
C  1.093259 3.019051 -0.784683
C  2.078203 -3.247041 0.76287
C  2.405703 2.325061 -0.383487
H  -2.541472 -2.4175 -0.277823
H  -3.478153 2.352896 0.880986
H  -4.822228 -1.77145 0.517273
H  -5.310851 0.635621 1.085723
H  -0.138308 -2.10906 0.963155
H  0.020578 1.301967 -1.524048
H  2.277612 -1.386249 -0.333671
H  1.610244 -2.725741 -1.288774
H  0.850397 3.781759 -0.017813
H  1.25429 3.546179 -1.744105
H  3.821834 -4.70767 1.518418
H  4.791666 2.575416 -0.092439
