program: Gaussian 09
title: 000276518
version: EM64L-G09RevD.01
frameworkgroup: C1[X(C13H24O4)]
method: RPBEPBE
basis: SDD
operation: Freq
keyword: #pfreq=noraman
keyword: PBEPBE/SDD
title: #p freq=noraman PBEPBE/SDD
converged: NO YES NO NO
title: Mulliken charges:
elementType: O O O O C C C C C C C C C C C C C H H H H H H H H H H H H H H H H H H H H H H H H
charge: -0.266122 -0.265722 -0.223257 -0.226645 -0.022609 -0.457704 -0.396102 -0.282606 -0.748642 -0.382290 0.227364 0.222829 -0.692786 -0.257459 -0.261541 -0.666614 -0.663623 0.239603 0.216985 0.232519 0.190428 0.191947 0.278735 0.207124 0.214842 0.222148 0.218327 0.205262 0.208414 0.215471 0.208943 0.224572 0.236622 0.237053 0.226324 0.251139 0.225710 0.219022 0.226502 0.247929 0.217909
chargesum: 0.00000
title: Mulliken charges with hydrogens summed into heavy atoms:
elementType: O O O O C C C C C C C C C C C C C
charge: -0.266122 -0.265722 -0.223257 -0.226645 0.216994 -0.008199 -0.013726 -0.003871 -0.104528 0.041300 0.227364 0.222829 -0.059958 0.203734 0.201836 0.029257 0.028717
polarizability: 1.64470767e+02 4.15447311e+00 1.57306120e+02 -6.40968934e-01 -5.38099597e+00 1.39708821e+02
1716.lowfreq: -15.3245 -7.6126 -2.3601 -0.0006 -0.0005 -0.0004 5.4743 19.4639 31.4624
frequency: -9.3235 18.4699 31.4521 32.9071 49.1595 60.7376 65.9001 78.0388 80.2868 104.6027 132.2909 143.2499 175.1940 198.2929 201.3823 206.4042 227.2602 237.5480 250.9355 279.4701 289.8769 316.0950 332.9441 344.0583 391.7587 409.2365 439.6859 506.1902 534.6183 574.4009 657.6142 692.7570 712.1557 734.0886 769.4343 791.4778 810.4468 817.2419 827.1066 840.5858 859.9480 890.3290 928.0438 945.1984 953.3071 1004.1591 1010.9228 1015.5433 1028.0331 1049.3706 1061.8103 1091.5342 1096.4754 1106.1263 1111.4026 1135.8790 1150.2568 1156.3966 1158.3433 1171.1861 1200.7426 1240.9932 1256.0012 1276.3049 1279.1769 1280.7456 1292.7720 1308.2563 1316.0370 1341.1568 1349.3573 1353.7180 1360.0469 1363.2149 1385.6101 1388.9507 1390.2313 1391.7510 1456.9657 1458.4857 1460.0202 1462.1335 1463.3335 1467.0233 1475.7429 1477.0322 1477.9347 1480.7441 1483.5306 1484.3980 1490.4124 1638.1022 1649.1597 2954.0911 2970.4274 2971.0468 2975.6619 2987.3818 2992.2766 2992.6169 2996.4426 3000.4595 3029.1554 3031.1885 3032.0393 3042.8516 3060.2477 3067.1005 3068.1396 3070.4806 3071.3105 3087.4036 3087.7314 3093.0130 3093.3515 3119.5988 3119.8012
redmass: 3.6236 4.0942 3.3965 3.4665 3.2529 2.7286 1.7919 4.0972 5.6005 3.2200 4.4104 3.3386 2.2086 1.2507 1.2259 1.3513 1.5056 1.8936 2.1732 2.3406 2.5647 2.9930 3.3656 4.6143 2.4859 3.1327 3.4400 3.3930 2.3539 6.4245 3.8424 5.6286 4.2081 1.1305 2.0914 2.4030 1.3554 1.5812 3.1077 1.7028 1.7832 1.8521 3.3988 1.9305 1.7797 2.0584 2.0149 2.4990 1.6325 2.6871 2.9051 2.3168 2.1601 2.3489 2.5160 2.4585 2.7161 1.6767 1.6993 1.9249 1.4952 1.2800 1.4624 1.1182 1.1613 1.3196 1.1557 1.3573 1.4542 1.4049 1.4551 1.2941 1.3240 1.4231 1.2087 1.2180 1.2324 1.2351 1.0917 1.0906 1.0771 1.0465 1.0460 1.0607 1.0574 1.0459 1.0507 1.0573 1.0518 1.0523 1.0840 8.7796 10.0649 1.0611 1.0356 1.0376 1.0582 1.0796 1.0360 1.0360 1.0908 1.0695 1.1019 1.0596 1.0596 1.0853 1.0987 1.0996 1.1006 1.0993 1.0994 1.0973 1.0976 1.1030 1.1028 1.1066 1.1065
irintensity: 0.1231 0.8406 0.8526 0.4339 0.6835 1.1769 0.2203 0.7612 0.4211 1.2052 1.3191 0.4939 1.7137 1.1173 2.8032 1.0729 0.8052 0.9064 0.7829 2.1001 4.9074 6.1247 6.2161 12.1171 3.7688 1.0098 5.9240 4.4362 3.1039 11.7304 7.0490 1.5225 12.2143 7.7872 9.4631 1.0326 2.7688 5.2755 4.3251 0.6970 1.7273 6.9179 2.1656 22.1683 0.7376 6.5340 14.3549 80.5329 47.8354 3.5164 79.4775 121.8554 36.3436 184.2859 99.1708 51.7730 65.5998 14.3284 24.4269 14.7635 52.7834 11.3707 99.2452 2.4170 1.7360 14.7365 4.5127 22.4149 41.1052 9.2339 2.0824 2.2606 6.5364 0.7141 9.8507 17.7910 23.6760 22.1811 14.8093 18.0978 5.4454 15.2394 12.9300 6.8362 2.4691 9.4238 8.5125 8.1194 13.4132 13.6884 19.8510 129.6731 179.1400 21.9493 49.7192 24.0265 30.6180 6.6800 23.4209 12.5120 24.4919 32.8745 39.4048 26.1553 27.2097 4.5940 3.1541 59.5896 53.5580 66.3760 55.7110 33.5063 39.2053 1.6022 1.9231 28.3974 31.6742
temp: 298.150 k
press: 1.00000 atm
elementType: 8 8 8 8 6 6 6 6 6 6 6 6 6 6 6 6 6 1 1 1 1 1 1 1 1 1 1 1 1 1 1 1 1 1 1 1 1 1 1 1 1
symmnumber: 1
zpe: 923538.2 jmol-1
zpe.correction: 0.351757 hartree
zpe.thermalcorrener: 0.372423 hartree
zpe.thermalcorrenthalpy: 0.373367 hartree
zpe.thermalcorrgfe: 0.299798 hartree
zpe.sumelectzpe: -809.304781 hartree
zpe.sumelectthermal: -809.284116 hartree
zpe.sumelectthermalent: -809.283171 hartree
zpe.sumelectthermalfe: -809.356740 hartree
dipole: 1.0736 0.2678 -2.2994
dipole: 2.5517
quadrupole: -94.7494 -98.1551 -109.6080
quadrupole: 6.7275 7.3545 -2.1577
quadrupole: 6.0881 2.6824 -8.7705 6.7275 7.3545 -2.1577
hfenergy: -809.6565385 hartree
pointgroup: C01 [X(C13H24O4)]
dipole: 0.358231 -0.3614023 -0.8654115 debye
polarizability: 165.1341482|-4.0283302|154.6942622|-4.1662962|-6.0865386|141.6572979 unknown
InChI: InChI=1S/C13H24O4/c1-5-8-10(4)9-11(12(14)16-6-2)13(15)17-7-3/h10-11H,5-9H2,1-4H3
charge 0 multiplicity 1
41 atoms
O  1.954396 0.769082 -1.014693
O  -1.885521 1.431406 -0.980188
O  0.960137 2.390421 0.343299
O  -2.171033 0.838419 1.258493
C  -0.552369 -2.034598 1.36176
C  0.27327 -0.723713 1.232713
C  -0.48216 -2.945577 0.101405
C  -0.11776 0.171426 0.023346
C  -0.110396 -2.78615 2.641367
C  0.935051 -3.36321 -0.360732
C  0.94454 1.255123 -0.180204
C  -1.489358 0.826851 0.211078
C  0.890949 -4.325766 -1.567933
C  3.13464 1.66733 -1.22467
C  -3.181068 2.180901 -0.955834
C  4.159224 1.483053 -0.102224
C  -4.352496 1.247447 -1.272043
H  -1.613727 -1.744386 1.500375
H  1.347719 -0.974658 1.146064
H  0.144824 -0.130188 2.157014
H  -1.071594 -3.862636 0.309973
H  -0.997912 -2.450881 -0.748659
H  -0.144261 -0.429526 -0.902341
H  0.961659 -3.057278 2.606303
H  -0.690902 -3.718257 2.772305
H  -0.267884 -2.160094 3.538986
H  1.523099 -2.464767 -0.634052
H  1.474697 -3.850432 0.475216
H  0.339841 -5.251944 -1.316764
H  1.907057 -4.614326 -1.89443
H  0.379906 -3.856651 -2.430273
H  3.5275 1.350861 -2.203922
H  2.774394 2.709775 -1.275085
H  -3.293577 2.649387 0.037389
H  -3.045284 2.954421 -1.728321
H  3.743534 1.811276 0.865244
H  4.469414 0.426859 -0.020605
H  5.058105 2.091266 -0.314213
H  -4.200521 0.737326 -2.238973
H  -4.474438 0.488526 -0.481035
H  -5.288397 1.83338 -1.334235
