program: Gaussian 09
title: 000276496
version: EM64L-G09RevD.01
frameworkgroup: C1[X(C17H15ClN2)]
method: RPBEPBE
basis: SDD
operation: Freq
keyword: #p
keyword: freq=noraman
keyword: PBEPBE/SDD
title: #p freq=noraman PBEPBE/SDD
converged: YES YES NO NO
title: Mulliken charges:
elementType: Cl N N C C C C C C C C C C C C C C C C C H H H H H H H H H H H H H H H
charge: -0.073678 -0.438698 -0.084208 -0.542942 -0.554217 0.430340 0.604542 -0.521324 0.063258 0.342726 -0.326850 -0.374841 -0.376196 -0.370505 -0.232588 -0.235409 -0.230459 -0.249365 -0.233868 -0.242564 0.259386 0.215351 0.221982 0.240012 0.256424 0.320614 0.243686 0.221804 0.267885 0.255183 0.236014 0.235853 0.222690 0.223796 0.226165
chargesum: 0.00000
title: Mulliken charges with hydrogens summed into heavy atoms:
elementType: Cl N N C C C C C C C C C C C C C C C C C
charge: -0.073678 -0.118085 -0.084208 -0.068205 -0.092223 0.430340 0.604542 -0.264900 0.063258 0.342726 -0.326850 -0.131155 -0.154392 -0.102620 0.022596 0.000606 0.005394 -0.026674 -0.010072 -0.016399
polarizability: 2.55216087e+02 2.96581718e+01 2.15054446e+02 3.25246134e+01 -1.54630005e+01 1.31892912e+02
1716.lowfreq: -1.6915 0.0007 0.0008 0.0018 3.3326 8.1455 17.5673 20.8036 28.9376
frequency: 17.3406 20.7378 28.8750 38.1759 77.8366 84.5081 117.2542 140.9143 172.7429 227.2958 268.9383 281.5244 313.5163 337.6203 348.2961 402.3358 414.8061 423.8465 453.8636 457.2053 505.8762 518.6359 569.0164 600.8412 616.1221 627.2105 656.7931 678.4663 690.3575 698.4731 702.5311 726.3497 759.9066 770.3923 780.7046 827.9782 854.0383 864.0449 910.4646 923.4401 928.5196 932.2103 952.2788 979.9995 986.4933 988.7920 989.2292 999.1773 1015.8862 1020.0007 1025.6529 1041.0789 1051.7860 1077.9461 1105.1264 1135.7500 1147.4644 1171.4301 1173.3945 1188.5947 1192.7813 1203.3697 1218.4906 1273.6997 1281.6377 1306.6279 1313.7427 1336.8527 1370.5681 1375.7309 1382.1667 1414.6547 1425.8910 1432.1078 1449.6147 1463.1154 1465.9962 1469.2283 1516.2098 1565.0533 1574.6600 1589.0907 1606.7846 1619.8225 2989.0398 3003.0138 3058.1732 3070.3444 3121.5956 3130.5043 3132.8218 3143.7998 3144.4561 3155.6820 3161.2248 3166.8623 3175.5245 3233.9067 3605.0175
redmass: 5.3946 5.7908 5.6949 4.7998 4.9643 5.7793 5.1969 3.8605 4.7038 5.0858 4.2377 3.7015 4.8352 3.4834 4.9458 2.8183 4.3403 3.3150 3.9334 3.6209 3.7337 4.7740 3.5090 1.8373 5.5839 2.4578 6.2524 3.2039 2.5234 2.5456 2.9030 4.0204 1.2426 3.4453 1.8060 1.5632 1.2543 1.3425 2.1191 2.4818 1.4701 7.4533 1.4260 1.3743 1.7401 6.0822 1.8582 1.3285 5.9994 2.8575 3.3324 2.1138 2.2494 1.7008 1.5913 2.4545 1.3168 1.0585 1.0840 1.1841 1.3104 1.9530 1.9202 2.1988 1.3966 1.3633 1.4048 1.5442 2.2046 6.2235 5.0844 3.5331 2.1585 2.6019 2.6498 1.9013 1.1152 1.2993 3.7809 4.9541 6.0094 6.0685 7.1976 6.0818 1.0640 1.0607 1.1008 1.0994 1.0844 1.0879 1.0865 1.0932 1.0902 1.0962 1.0951 1.1002 1.0997 1.0987 1.0818
irintensity: 0.1226 0.2659 0.3145 1.0706 1.2576 0.1182 1.1210 2.6359 1.1099 0.8106 0.2255 2.0296 1.5035 0.2866 2.8229 0.0248 1.0492 1.7373 4.4442 8.9764 10.1238 3.6092 8.6773 21.9877 1.8143 19.8244 17.7976 30.4682 26.7572 21.0764 21.6769 2.0888 86.8571 12.6269 66.6101 25.5658 0.6430 0.9991 9.5049 0.2533 5.5232 15.3370 4.4466 0.1020 0.3448 0.6798 0.3020 0.7479 59.2728 13.7744 3.3297 2.3750 3.5298 17.3841 14.6101 10.0847 1.8174 0.1501 0.8082 2.0824 3.8458 7.7458 5.1396 7.9715 1.4071 1.8839 0.8202 11.1047 2.7256 3.4840 2.5500 8.0246 20.8190 24.6590 27.8057 18.9694 4.4550 29.8778 6.4982 26.7738 11.3572 2.7038 1.7215 10.8792 29.8532 37.1031 11.4591 15.7149 2.9896 6.0903 2.2718 38.0340 10.8616 24.7485 13.3893 17.4082 10.3370 1.0610 71.4765
temp: 298.150 k
press: 1.00000 atm
elementType: 17 7 7 6 6 6 6 6 6 6 6 6 6 6 6 6 6 6 6 6 1 1 1 1 1 1 1 1 1 1 1 1 1 1 1
symmnumber: 1
zpe: 723501.2 jmol-1
zpe.correction: 0.275567 hartree
zpe.thermalcorrener: 0.292586 hartree
zpe.thermalcorrenthalpy: 0.293530 hartree
zpe.thermalcorrgfe: 0.227106 hartree
zpe.sumelectzpe: -1224.972374 hartree
zpe.sumelectthermal: -1224.955355 hartree
zpe.sumelectthermalent: -1224.954411 hartree
zpe.sumelectthermalfe: -1225.020835 hartree
dipole: -1.6797 0.1497 0.9270
dipole: 1.9244
quadrupole: -131.0277 -105.3661 -125.1140
quadrupole: 4.9813 -0.2172 -4.9935
quadrupole: -10.5251 15.1365 -4.6114 4.9813 -0.2172 -4.9935
hfenergy: -1225.247941 hartree
pointgroup: C01 [X(C17H15Cl1N2)]
dipole: 0.6752219 0.0338296 -0.3407895 debye
polarizability: 251.2377077|-29.9079085|217.1456748|38.2672314|11.0694902|133.7800625 unknown
InChI: InChI=1S/C17H15ClN2/c18-16-9-5-4-6-13(16)10-11-15-12-17(20-19-15)14-7-2-1-3-8-14/h1-9,12,19H,10-11H2
charge 0 multiplicity 1
35 atoms
Cl 4.854779 -0.366706 1.557402
N  -0.444597 -2.670954 -0.340398
N  -1.722326 -2.160849 -0.500108
C  1.850765 -2.175284 0.623622
C  2.827289 -1.658952 -0.49104
C  0.407555 -1.834323 0.371798
C  2.957328 -0.147474 -0.515845
C  -0.36638 -0.707482 0.688398
C  -1.672624 -0.939122 0.135179
C  -2.864927 -0.070552 0.179327
C  3.817891 0.562573 0.356439
C  2.18325 0.636808 -1.413334
C  -2.814733 1.209394 0.794969
C  -4.092158 -0.501698 -0.397083
C  3.931331 1.965735 0.357304
C  2.271273 2.045588 -1.436485
C  3.147532 2.713306 -0.551239
C  -3.959056 2.034566 0.835862
C  -5.233626 0.324072 -0.356148
C  -5.17473 1.597052 0.261047
H  2.166748 -1.752842 1.59314
H  1.970984 -3.273804 0.70505
H  2.47099 -2.015715 -1.47474
H  3.815723 -2.118412 -0.307019
H  -0.021743 0.161591 1.243254
H  -0.240901 -3.595839 -0.714142
H  1.498289 0.122393 -2.096833
H  -1.879582 1.564035 1.242697
H  -4.129614 -1.487744 -0.870785
H  4.617416 2.461592 1.050019
H  1.658244 2.617978 -2.14042
H  3.226683 3.805451 -0.562297
H  -3.902488 3.018382 1.315567
H  -6.171656 -0.023511 -0.803977
H  -6.063032 2.237845 0.293623
