program: Gaussian 09
title: 000276482
version: EM64L-G09RevD.01
frameworkgroup: C1[X(C12H10ClN5)]
method: RPBEPBE
basis: SDD
operation: Freq
keyword: #p
keyword: freq=noraman
keyword: PBEPBE/SDD
title: #p freq=noraman PBEPBE/SDD
converged: YES YES NO NO
title: Mulliken charges:
elementType: Cl N N N N N C C C C C C C C C C C C H H H H H H H H H H
charge: -0.014295 -0.146673 -0.082325 0.035499 0.023194 -0.609308 -0.581600 0.189279 0.497322 -0.099136 -0.218006 0.185101 -0.413350 -0.357786 -0.222498 -0.230365 -0.358966 -0.232422 0.262344 0.225808 0.265625 0.226261 0.275894 0.228513 0.232338 0.232201 0.338865 0.348484
chargesum: 0.00000
title: Mulliken charges with hydrogens summed into heavy atoms:
elementType: Cl N N N N N C C C C C C C C C C C C
charge: -0.014295 -0.146673 -0.082325 0.035499 0.023194 0.078041 -0.093448 0.189279 0.497322 -0.099136 0.047620 0.185101 -0.187088 -0.081892 0.006015 0.001973 -0.358966 -0.000221
polarizability: 2.15370790e+02 -1.53227283e+01 1.85043625e+02 -9.86206382e+00 4.23281236e+00 1.06940216e+02
1716.lowfreq: -3.0055 -0.0027 -0.0021 -0.0015 3.3382 5.4852 21.9640 35.6927 41.1485
frequency: 20.9821 35.5998 41.1379 99.8481 128.6768 142.5205 198.5377 224.7632 240.0256 276.2375 290.5359 345.4325 362.8487 366.8609 404.4590 457.5911 513.0295 527.9920 546.6951 547.6731 585.4307 610.1014 617.7454 639.2538 663.5640 665.8771 701.9775 717.3227 751.8405 786.5529 789.4615 812.4283 826.8231 860.8820 867.5319 927.1449 949.1401 984.9615 989.8692 992.5096 1004.5974 1018.5031 1027.6263 1083.7290 1131.4197 1172.9509 1174.7848 1192.1796 1210.0240 1223.9757 1248.4164 1299.6876 1314.3061 1338.6099 1348.5452 1357.7980 1384.4588 1389.5734 1425.9643 1444.8729 1451.9338 1472.7872 1486.1980 1546.6043 1579.1135 1596.2804 1614.8421 1634.2773 3021.5466 3081.3281 3113.1644 3126.8869 3136.5475 3149.0799 3165.6581 3232.9387 3538.9633 3692.9126
redmass: 5.3859 5.0115 5.2273 7.4092 7.4198 5.1529 5.6565 6.6043 4.6756 5.8259 4.1218 2.5577 8.9921 8.0613 2.8294 3.7990 8.0334 1.2154 1.1177 5.1007 4.2879 4.5476 6.1691 5.3938 10.7865 7.2600 3.4523 1.8025 5.2104 3.6031 4.4013 2.4389 2.2415 1.2483 6.7934 1.5639 1.7830 1.4073 5.6475 3.1695 1.3252 4.3437 2.2642 1.7052 2.1298 1.9088 1.0824 1.1451 2.7522 2.6309 2.9915 6.5330 1.9291 1.3804 7.2586 1.4713 8.2498 6.9155 4.1591 2.2008 1.8215 1.9639 2.1615 6.1252 2.0304 6.0732 5.9665 2.5796 1.0594 1.1050 1.0884 1.0870 1.0914 1.0960 1.1015 1.0985 1.0445 1.1057
irintensity: 0.3879 1.0696 0.4243 0.6762 4.9986 2.5976 4.8370 0.2787 6.5767 0.8098 4.5764 0.1388 2.5366 1.5980 0.1879 4.0415 9.5487 252.1823 6.7418 15.1096 2.5036 7.9746 1.3659 50.5736 9.6087 1.3996 2.3165 129.2378 25.3130 2.5795 16.5895 12.3250 2.9167 0.4825 34.6762 0.0256 9.2142 0.4213 0.2154 59.8808 1.7886 7.1521 9.0232 22.9805 31.1355 18.4524 1.3482 1.8742 24.4048 107.5881 96.5771 151.0327 51.1242 7.3871 102.5740 5.0459 13.5568 19.4223 37.0296 15.1633 17.7251 50.1935 25.7506 112.7720 69.4445 1.5362 6.0846 638.5647 26.0514 3.8739 10.3603 0.1993 7.6248 24.8655 26.4792 0.0166 143.1912 53.4594
temp: 298.150 k
press: 1.00000 atm
elementType: 17 7 7 7 7 7 6 6 6 6 6 6 6 6 6 6 6 6 1 1 1 1 1 1 1 1 1 1
symmnumber: 1
zpe: 543971.6 jmol-1
zpe.correction: 0.207188 hartree
zpe.thermalcorrener: 0.221784 hartree
zpe.thermalcorrenthalpy: 0.222728 hartree
zpe.thermalcorrgfe: 0.163383 hartree
zpe.sumelectzpe: -1195.856755 hartree
zpe.sumelectthermal: -1195.842159 hartree
zpe.sumelectthermalent: -1195.841215 hartree
zpe.sumelectthermalfe: -1195.900560 hartree
dipole: 2.7041 -3.5511 0.2729
dipole: 4.4718
quadrupole: -97.1810 -111.4639 -106.8812
quadrupole: 8.3656 -5.7613 3.7565
quadrupole: 7.9944 -6.2885 -1.7059 8.3656 -5.7613 3.7565
hfenergy: -1196.0639429 hartree
pointgroup: C01 [X(C12H10Cl1N5)]
dipole: -0.875318 -1.5153792 -0.1808672 debye
polarizability: 211.0737163|19.077928|189.7550842|-7.8063552|-1.6100838|106.5258298 unknown
InChI: InChI=1S/C12H10ClN5/c13-12-16-10(14)9-11(17-12)18(7-15-9)6-8-4-2-1-3-5-8/h1-5,7H,6,14H2
charge 0 multiplicity 1
28 atoms
Cl 2.678246 3.378066 0.539917
N  -0.02601 -1.015557 0.844431
N  1.497224 -2.343712 -0.25386
N  1.187027 1.150227 0.749979
N  3.350387 0.94384 -0.381936
N  4.155221 -1.084674 -1.279934
C  -1.265001 -0.584265 1.536326
C  1.041812 -0.186207 0.501701
C  -2.366084 -0.134276 0.581141
C  1.973767 -1.023452 -0.169763
C  0.299515 -2.293185 0.360312
C  3.174703 -0.399859 -0.620499
C  -3.498075 -0.95235 0.346963
C  -2.262995 1.117498 -0.078867
C  -4.514707 -0.531504 -0.541245
C  -3.276885 1.536622 -0.967311
C  2.367023 1.604297 0.27095
C  -4.404445 0.713683 -1.201141
H  -0.96966 0.243807 2.20464
H  -1.607718 -1.426921 2.161889
H  -0.370106 -3.141705 0.484777
H  -3.589635 -1.917616 0.861569
H  -1.388748 1.752886 0.107508
H  -5.388252 -1.169617 -0.715004
H  -3.190871 2.504443 -1.473425
H  -5.191487 1.041991 -1.889172
H  4.991757 -0.588891 -1.581207
H  4.038999 -2.078772 -1.466037
