program: Gaussian 09
title: 000276488
version: EM64L-G09RevD.01
frameworkgroup: C1[X(C14H19NO2)]
method: RPBEPBE
basis: SDD
operation: Freq
keyword: #p
keyword: freq=noraman
keyword: PBEPBE/SDD
title: #p freq=noraman PBEPBE/SDD
converged: YES YES NO NO
title: Mulliken charges:
elementType: O O N C C C C C C C C C C C C C C H H H H H H H H H H H H H H H H H H H
charge: -0.500142 -0.316370 -0.617545 0.399031 -0.466550 -0.480458 -0.405404 -0.389550 -0.387172 -0.713199 0.441872 0.103486 -0.388088 -0.385200 -0.244864 0.154030 -0.246093 0.227544 0.171947 0.184507 0.209248 0.229682 0.182473 0.182777 0.221419 0.177694 0.198005 0.239393 0.216016 0.366967 0.245791 0.249032 0.232104 0.233669 0.335512 0.338435
chargesum: 0.00000
title: Mulliken charges with hydrogens summed into heavy atoms:
elementType: O O N C C C C C C C C C C C C C C
charge: -0.133175 -0.316370 0.056402 0.399031 -0.067058 -0.086702 0.006752 0.014646 -0.011473 -0.257790 0.441872 0.103486 -0.142297 -0.136168 -0.012759 0.154030 -0.012424
polarizability: 2.00938894e+02 5.30360013e+00 1.72808399e+02 -1.22193274e+01 8.31171198e-01 1.10542356e+02
1716.lowfreq: -9.6168 -0.0007 0.0006 0.0010 7.7097 11.7850 37.5327 62.4962 77.4167
frequency: 37.2195 62.4482 77.3796 103.3858 123.1067 165.2659 189.2971 208.8920 221.5080 235.8102 293.4518 309.0539 347.7843 382.7658 395.6671 402.0825 429.1337 455.2064 476.3735 489.1312 526.2612 544.3660 580.8442 606.4163 606.9947 624.2231 697.3019 707.8491 726.2904 740.4093 768.4902 781.2903 788.1474 822.9904 834.3110 851.4847 875.8209 889.6501 923.1077 924.5824 951.4176 962.3241 972.0903 994.6265 1042.6366 1048.8067 1055.5477 1058.8099 1068.0473 1090.4451 1094.3252 1133.8903 1142.1302 1151.1886 1173.7912 1179.4648 1210.2546 1213.3940 1258.8563 1260.8584 1266.5929 1297.5318 1310.4200 1321.2084 1336.2407 1340.2342 1342.4960 1352.1243 1360.2892 1383.0510 1425.5943 1431.5643 1442.6878 1452.6215 1454.0114 1466.1197 1469.1325 1476.0308 1480.9331 1558.9697 1580.8574 1607.5837 1623.6655 2952.3893 2952.9825 2961.3945 2982.9197 2985.4750 2988.8456 3016.4293 3022.4491 3040.9249 3046.1127 3048.0789 3057.2231 3124.2580 3131.1956 3145.9912 3164.5908 3226.8489 3518.2476 3673.7779
redmass: 4.0150 4.6175 4.2584 4.4006 3.5745 3.9413 4.9465 2.5240 3.7779 4.4353 4.5414 2.1595 3.3529 2.8287 2.6625 3.2082 2.0436 3.0090 3.3969 2.0961 3.0263 1.1387 3.8940 2.1450 1.7780 3.3645 3.5436 3.1548 2.6545 1.2184 1.6454 1.7757 2.6493 4.2040 2.6795 1.6378 2.1728 1.4453 2.4868 1.4246 2.2454 1.4216 1.9697 1.3345 2.4798 3.0437 1.9281 1.8198 1.6666 2.1482 1.5323 2.0475 1.7430 1.7925 1.5026 1.0910 1.5123 2.0755 1.3016 1.3446 1.2268 1.4391 1.4331 1.4344 1.4102 1.4267 1.3971 1.4504 3.6779 6.3208 1.5838 1.8533 1.0914 1.1061 1.0900 1.0864 1.1184 1.1286 2.5592 3.7073 4.2089 3.9106 1.8931 1.0606 1.0632 1.0630 1.0629 1.0633 1.0597 1.0995 1.0954 1.0968 1.1018 1.1015 1.1012 1.0856 1.0888 1.0941 1.1009 1.0690 1.0450 1.1044
irintensity: 2.2865 3.3317 2.9217 4.1435 1.0347 3.6833 7.6053 1.3010 3.5900 4.4310 2.1414 1.2152 0.4550 2.4776 2.3133 6.5498 1.6575 4.3239 4.9797 6.3003 11.7220 136.2664 4.9655 49.6612 54.1638 6.7977 23.2070 34.6917 85.9025 174.7854 11.7485 16.5986 41.5137 3.3327 5.5302 5.7572 7.8312 0.4940 6.9308 6.4130 5.6319 2.3466 24.8674 0.2815 3.6570 11.8782 6.5480 6.5723 4.4302 25.6691 1.8703 4.4517 2.7484 7.4923 2.2549 1.0803 4.7993 2.4141 6.3481 14.6529 1.3722 4.2217 38.7147 4.6286 3.3328 2.2722 3.7685 1.7015 173.1130 39.0127 51.5631 10.7266 3.3671 2.0973 8.4955 17.0479 5.7179 14.4851 26.3858 121.0358 6.0847 46.0546 311.9758 17.4641 45.3952 45.5023 49.5768 54.6998 32.9639 42.0076 81.6091 37.0929 11.1981 10.5910 89.9389 3.1663 3.8280 25.2692 24.6177 523.8110 53.6119 30.0770
temp: 298.150 k
press: 1.00000 atm
elementType: 8 8 7 6 6 6 6 6 6 6 6 6 6 6 6 6 6 1 1 1 1 1 1 1 1 1 1 1 1 1 1 1 1 1 1 1
symmnumber: 1
zpe: 802148.7 jmol-1
zpe.correction: 0.305522 hartree
zpe.thermalcorrener: 0.320982 hartree
zpe.thermalcorrenthalpy: 0.321926 hartree
zpe.thermalcorrgfe: 0.263274 hartree
zpe.sumelectzpe: -748.837710 hartree
zpe.sumelectthermal: -748.822250 hartree
zpe.sumelectthermalent: -748.821306 hartree
zpe.sumelectthermalfe: -748.879958 hartree
dipole: 5.0316 0.5713 2.5511
dipole: 5.6702
quadrupole: -82.7132 -94.0438 -105.9352
quadrupole: -7.7090 -3.3415 -1.6347
quadrupole: 11.5176 0.1869 -11.7045 -7.7090 -3.3415 -1.6347
hfenergy: -749.1432321 hartree
pointgroup: C01 [X(C14H19N1O2)]
dipole: 1.960853 0.1264721 1.0562501 debye
polarizability: 202.2292557|2.4504794|172.1677183|-9.5762369|-1.5560798|109.8926747 unknown
InChI: InChI=1S/C14H19NO2/c15-13(16)12-7-3-2-6-11(12)10-14(17)8-4-1-5-9-14/h2-3,6-7,17H,1,4-5,8-10,15H2
charge 0 multiplicity 1
36 atoms
O  -1.186545 -0.744252 -0.988707
O  0.715089 -2.518961 -0.189458
N  2.932467 -2.673917 0.406581
C  -1.53562 -0.055817 0.259809
C  -1.959332 1.37483 -0.152358
C  -2.720905 -0.789798 0.95364
C  -3.227185 1.361657 -1.038106
C  -3.987444 -0.796624 0.068699
C  -4.398937 0.639591 -0.332246
C  -0.313713 -0.055769 1.25529
C  0.999303 0.438233 0.673588
C  1.993702 -0.432491 0.126181
C  1.285634 1.829026 0.695217
C  3.19833 0.103927 -0.40837
C  2.480567 2.357701 0.165044
C  1.811425 -1.927376 0.098616
C  3.442207 1.491137 -0.402891
H  -1.124908 1.851125 -0.698837
H  -2.152757 1.971063 0.7648
H  -2.944273 -0.291545 1.921112
H  -2.411123 -1.829061 1.182985
H  -2.986388 0.833814 -1.979833
H  -3.511719 2.399982 -1.299599
H  -4.815604 -1.305008 0.600702
H  -3.770522 -1.379749 -0.846718
H  -4.69054 1.208279 0.576888
H  -5.286866 0.612417 -0.99374
H  -0.202756 -1.089715 1.631588
H  -0.589269 0.580814 2.11812
H  -0.583338 -1.522873 -0.772702
H  0.549117 2.505165 1.143822
H  3.929627 -0.568973 -0.871778
H  2.659447 3.438263 0.191445
H  4.365483 1.890417 -0.835903
H  3.786769 -2.242022 0.753421
H  2.863678 -3.690896 0.360995
