program: Gaussian 09
title: 000276461
version: EM64L-G09RevD.01
frameworkgroup: C1[X(C15H17NO4S)]
method: RPBEPBE
basis: SDD
operation: Freq
keyword: #p
keyword: freq=noraman
keyword: PBEPBE/SDD
title: #p freq=noraman PBEPBE/SDD
converged: YES YES NO NO
title: Mulliken charges:
elementType: S O O O O N C C C C C C C C C C C C C C C H H H H H H H H H H H H H H H H H
charge: 0.943035 -0.538228 -0.515368 -0.287318 -0.272518 -0.506785 -0.098458 0.367428 -0.265355 -0.200453 0.449545 -0.458685 -0.407501 -0.367037 -0.368919 0.240604 0.219119 -0.298478 -0.799308 -0.520599 -0.536610 0.277748 0.284528 0.287585 0.312610 0.225242 0.243030 0.244824 0.241392 0.229657 0.227746 0.245075 0.253714 0.215566 0.233723 0.224349 0.247522 0.227578
chargesum: 0.00000
title: Mulliken charges with hydrogens summed into heavy atoms:
elementType: S O O O O N C C C C C C C C C C C C C C C
charge: 0.943035 -0.538228 -0.515368 -0.287318 -0.272518 -0.229036 -0.098458 0.367428 0.019173 0.087132 0.449545 -0.146075 -0.182259 -0.124007 -0.124095 0.240604 0.219119 -0.057086 -0.096830 0.182403 0.162839
polarizability: 2.88967352e+02 -2.32379111e+01 2.26126321e+02 1.94093430e+01 4.31415661e+00 1.78876819e+02
1716.lowfreq: -15.4184 -6.5025 -0.0010 0.0006 0.0017 2.8290 9.2063 15.9382 22.3134
frequency: 7.1773 15.4258 21.8356 39.6414 56.9578 59.8554 68.2751 93.3479 119.3730 127.8061 130.7050 154.8919 164.9576 183.7701 199.1179 223.1542 235.0345 252.7743 281.5487 289.6265 295.9519 333.0150 372.6588 379.7422 392.1170 408.5032 409.2619 445.5015 449.5059 483.5840 497.9163 509.1284 579.4511 592.0409 621.0658 634.3718 706.8936 708.8778 721.3973 730.3901 776.1558 793.7455 804.8860 825.5897 830.0271 850.6439 892.2031 899.9446 913.7990 951.3465 963.2370 979.6785 981.9578 990.5959 991.7770 994.6543 1048.5687 1048.8635 1108.6741 1109.6831 1110.5981 1120.1106 1145.3563 1154.4856 1175.6292 1186.1453 1206.7445 1217.1224 1218.4439 1252.8079 1283.6348 1297.7667 1379.7224 1380.1396 1391.2629 1398.2816 1414.1241 1432.3906 1443.9269 1456.2685 1466.9831 1470.7355 1471.1847 1472.1550 1473.5013 1479.8062 1487.9780 1560.3279 1591.8958 1594.1530 1600.8166 2964.8823 2978.2552 2979.9833 3055.7099 3062.3005 3084.9929 3091.3258 3128.4179 3128.5869 3130.6714 3132.9734 3136.8451 3157.2022 3163.4177 3166.4573 3177.5985 3366.4948
redmass: 4.4787 1.6109 1.8089 4.1321 4.2189 6.6052 2.1355 3.9967 2.9600 5.9533 2.0285 6.3841 2.4424 9.4893 3.5011 8.1357 1.5700 2.6520 4.0197 5.0947 4.4768 4.6962 3.5433 6.3648 5.8354 3.1573 3.9810 5.8944 4.6437 4.3353 4.3397 3.4436 5.9318 4.4733 6.9533 3.8596 3.5307 5.2692 5.5336 3.3544 4.8415 1.5470 4.4264 1.3541 1.8520 1.2422 3.1380 2.1198 1.3588 7.9807 1.2916 8.2174 1.4143 1.4335 5.6264 3.2155 1.7508 2.1682 2.2159 1.2392 1.2984 1.2946 1.4955 1.3824 1.6889 1.1352 1.9279 1.4369 2.2704 2.7053 2.3408 1.2637 5.6757 5.2399 3.1234 1.2203 1.8069 1.2428 1.5893 1.0773 1.0506 1.0978 1.1918 2.1329 1.0663 1.0570 2.2895 7.3253 6.7877 6.0196 6.3991 1.0326 1.0336 1.0388 1.1042 1.0949 1.0989 1.1001 1.1002 1.1015 1.0912 1.0887 1.0897 1.0960 1.0941 1.0961 1.0930 1.0753
irintensity: 0.5771 1.0291 0.7957 0.3970 1.4561 2.1371 5.0263 4.8515 5.1540 1.5160 5.2354 12.1592 5.3668 3.0329 0.5944 5.1878 1.9976 10.1922 2.0657 2.4482 0.6900 10.7461 1.2934 8.1433 18.2952 5.5347 16.2686 46.3354 56.5036 11.2224 26.2078 57.7739 27.0696 9.0958 0.1982 3.2101 2.2255 13.2667 9.2507 2.7796 2.6587 47.4390 59.5137 65.2577 145.1922 0.4539 5.5854 29.1979 2.6705 38.7606 0.7068 54.2114 0.4373 1.0981 1.1114 61.4351 36.8948 10.0256 88.3072 7.5908 4.2944 6.1230 13.8797 7.1600 26.0435 11.5077 54.6394 9.2052 4.2315 261.1718 50.5415 3.3330 1.4956 21.1936 10.4811 15.5787 9.6213 3.7905 30.3586 18.7736 13.2556 23.6228 100.6473 28.6436 13.9422 26.6129 127.8810 30.9523 0.3585 12.6104 37.3649 74.7559 98.7548 22.3882 39.5280 16.1933 33.7514 14.9686 17.8247 26.5206 0.3126 12.2068 7.5657 6.5882 11.8713 5.5653 2.4754 16.7779
temp: 298.150 k
press: 1.00000 atm
elementType: 16 8 8 8 8 7 6 6 6 6 6 6 6 6 6 6 6 6 6 6 6 1 1 1 1 1 1 1 1 1 1 1 1 1 1 1 1 1
symmnumber: 1
zpe: 759588.6 jmol-1
zpe.correction: 0.289312 hartree
zpe.thermalcorrener: 0.311736 hartree
zpe.thermalcorrenthalpy: 0.312681 hartree
zpe.thermalcorrgfe: 0.233449 hartree
zpe.sumelectzpe: -1333.744804 hartree
zpe.sumelectthermal: -1333.722380 hartree
zpe.sumelectthermalent: -1333.721436 hartree
zpe.sumelectthermalfe: -1333.800667 hartree
dipole: -3.5355 8.9777 3.5147
dipole: 10.2690
quadrupole: -114.4687 -135.8709 -126.1598
quadrupole: 13.5268 -0.8551 0.2391
quadrupole: 11.0311 -10.3711 -0.6600 13.5268 -0.8551 0.2391
hfenergy: -1334.0341163 hartree
pointgroup: C01 [X(C15H17N1O4S1)]
dipole: -1.3339919 -3.5264975 -1.4515182 debye
polarizability: 282.6860691|27.6225303|228.2111872|-26.882436|3.458445|183.0732359 unknown
InChI: InChI=1S/C15H17NO4S/c1-11-4-7-13(8-5-11)21(17,18)16-12-6-9-14(19-2)15(10-12)20-3/h4-10,16H,1-3H3
charge 0 multiplicity 1
38 atoms
S  1.944223 2.165378 0.054526
O  3.03055 2.999222 -0.828083
O  1.535252 2.573658 1.571175
O  -2.938625 0.376201 2.049824
O  -3.720089 -1.55643 0.128932
N  0.269006 2.298306 -1.011556
C  2.487779 0.352595 0.096631
C  -0.693742 1.285862 -0.764085
C  3.381847 -0.094667 -0.890111
C  1.983704 -0.473921 1.114678
C  3.304302 -2.327364 0.158824
C  -1.385442 1.297899 0.480675
C  -1.032404 0.304078 -1.734395
C  3.787634 -1.44657 -0.845915
C  2.40084 -1.822918 1.131796
C  -2.383963 0.350516 0.761318
C  -2.7326 -0.627733 -0.230204
C  -2.064547 -0.620636 -1.478219
C  3.774246 -3.769435 0.214639
C  -4.411346 0.442527 2.170064
C  -4.053208 -2.605267 -0.840456
H  0.640574 2.298181 -1.981136
H  3.769455 0.599436 -1.643333
H  1.307306 -0.070978 1.87507
H  -1.146664 2.055107 1.23291
H  -0.499313 0.272938 -2.692229
H  4.493043 -1.819632 -1.597556
H  2.021564 -2.489048 1.915194
H  -2.322051 -1.356268 -2.245693
H  2.997069 -4.43412 0.630273
H  4.051846 -4.146361 -0.784906
H  4.667499 -3.865321 0.861931
H  -4.885045 -0.462381 1.75625
H  -4.797126 1.344324 1.65686
H  -4.599725 0.52027 3.251383
H  -4.467601 -2.174968 -1.772516
H  -4.817136 -3.220512 -0.343331
H  -3.16761 -3.225965 -1.07563
