program: Gaussian 09
title: 000276413
version: EM64L-G09RevD.01
frameworkgroup: C1[X(C13H13N3O)]
method: RPBEPBE
basis: SDD
operation: Freq
keyword: #p
keyword: freq=noraman
keyword: PBEPBE/SDD
title: #p freq=noraman PBEPBE/SDD
converged: YES YES NO NO
title: Mulliken charges:
elementType: O N N N C C C C C C C C C C C C C H H H H H H H H H H H H H
charge: -0.227223 -0.279059 -0.029201 -0.009597 -0.361236 -0.404579 0.195322 0.137043 -0.420240 -0.774067 0.420303 -0.351244 -0.390129 -0.156813 -0.220902 -0.202445 -0.247829 0.288575 0.262664 0.232919 0.278935 0.253401 0.239421 0.258592 0.242086 0.299605 0.279383 0.228481 0.227731 0.230102
chargesum: 0.00000
title: Mulliken charges with hydrogens summed into heavy atoms:
elementType: O N N N C C C C C C C C C C C C C
charge: -0.227223 -0.279059 -0.029201 -0.009597 -0.072661 0.091004 0.195322 0.137043 0.112096 -0.033968 0.420303 -0.051639 -0.110746 -0.156813 0.007579 0.025286 -0.017727
polarizability: 2.28734417e+02 -1.32473296e+01 1.46263742e+02 -1.90098959e+01 -1.67798055e+01 1.08902823e+02
1716.lowfreq: -11.6487 -4.8968 -1.4425 0.0004 0.0008 0.0009 27.3362 36.4014 53.9680
frequency: 27.2025 36.3698 53.9555 81.3172 94.9199 131.2162 139.6358 151.0852 161.8317 213.2081 234.7509 280.6652 328.1557 355.4753 361.3000 376.4680 388.9358 409.3228 491.7584 511.0716 559.2167 570.3961 613.9941 619.2180 651.6797 700.9346 715.9942 749.4877 770.7108 790.3225 828.2774 856.7963 904.2747 933.6173 947.0070 984.8320 986.4198 988.5667 988.9561 1000.2741 1018.5088 1029.9221 1036.2471 1056.0122 1088.4456 1098.8338 1151.3077 1165.1502 1173.1040 1189.2761 1200.8263 1207.3081 1283.4808 1292.7191 1311.8139 1325.1392 1354.6414 1370.3130 1383.1844 1403.5650 1447.5020 1450.5787 1452.6160 1457.8307 1464.3185 1486.3821 1572.5332 1593.8151 1611.3522 1629.9601 2202.3931 2976.2910 2989.2325 2991.6230 3018.2352 3044.6599 3049.5060 3083.1318 3108.6802 3131.1733 3142.7307 3162.7432 3187.7990 3190.3716
redmass: 6.9389 4.7524 5.2118 2.6660 4.5294 4.8634 4.2188 1.1154 6.2222 2.3040 4.5086 4.7884 4.6755 5.5777 4.5290 3.5794 7.4948 2.9627 7.3046 3.3432 5.4203 4.4351 6.4308 4.5147 6.1593 2.0992 3.8693 2.0085 1.6273 3.9611 2.9085 1.2431 3.6591 1.4150 3.9466 4.2567 2.4684 1.6438 1.8816 1.3009 1.8269 2.0164 3.7107 1.9354 2.4311 1.9617 2.2231 1.2836 1.0547 1.1551 1.6992 1.5565 1.5944 1.3380 2.1036 1.3550 1.5764 2.3208 9.0006 1.5081 2.2690 1.0855 1.1361 1.0618 1.0943 2.4742 5.6555 6.6810 5.9865 11.5094 12.4378 1.0386 1.0634 1.0758 1.0619 1.1001 1.0968 1.1043 1.0980 1.0854 1.0909 1.0974 1.0940 1.0963
irintensity: 0.4361 1.1593 3.9968 3.5136 2.9445 6.0392 1.8437 0.9027 2.7599 2.8555 1.1144 2.7826 6.0619 0.4324 0.5548 0.7732 1.2329 0.0119 3.9776 12.1871 9.2919 13.0948 0.0848 3.0949 8.0917 39.5858 21.8012 0.5260 77.0202 7.2474 0.9525 0.0407 13.6890 11.7057 1.5965 0.9459 1.4593 2.5952 4.3975 2.2087 4.2431 8.0607 30.4762 2.0534 5.7658 38.7961 7.4191 8.6633 0.0201 2.7412 1.8253 18.0333 35.5479 4.1708 105.9628 0.4100 16.3958 18.0522 0.3390 27.6274 6.3389 8.9178 25.5047 15.5854 17.9550 141.0219 5.1651 4.0639 62.0255 211.0689 13.0843 20.5063 2.3242 3.7614 25.1169 0.5936 14.3507 10.7833 7.9456 0.1778 22.0778 29.7687 1.9917 7.6591
temp: 298.150 k
press: 1.00000 atm
elementType: 8 7 7 7 6 6 6 6 6 6 6 6 6 6 6 6 6 1 1 1 1 1 1 1 1 1 1 1 1 1
symmnumber: 1
zpe: 613534.0 jmol-1
zpe.correction: 0.233683 hartree
zpe.thermalcorrener: 0.249354 hartree
zpe.thermalcorrenthalpy: 0.250299 hartree
zpe.thermalcorrgfe: 0.189104 hartree
zpe.sumelectzpe: -741.422484 hartree
zpe.sumelectthermal: -741.406813 hartree
zpe.sumelectthermalent: -741.405869 hartree
zpe.sumelectthermalfe: -741.467063 hartree
dipole: 1.3535 4.3027 0.8290
dipole: 4.5861
quadrupole: -111.7606 -100.0257 -103.1413
quadrupole: -18.6566 -13.3895 -1.0742
quadrupole: -6.7847 4.9502 1.8346 -18.6566 -13.3895 -1.0742
hfenergy: -741.6561671 hartree
pointgroup: C01 [X(C13H13N3O1)]
dipole: -0.5544479 1.7170066 -0.0070968 debye
polarizability: 228.0986625|17.7749994|139.3975594|-17.2112302|22.069191|116.4047591 unknown
InChI: InChI=1S/C13H13N3O/c1-10-12(8-5-9-14)13(17)16(15-10)11-6-3-2-4-7-11/h2-4,6-7,12H,5,8H2,1H3
charge 0 multiplicity 1
30 atoms
O  0.232308 -1.082124 -1.933748
N  -0.580844 0.466443 -0.292224
N  -0.063554 1.59993 0.431119
N  5.093761 -2.043933 1.115598
C  1.611661 0.825335 -1.054331
C  2.901228 0.012688 -0.767166
C  1.174978 1.807009 0.018497
C  0.363009 -0.071112 -1.191641
C  2.79174 -0.834727 0.531514
C  2.003602 2.925985 0.572002
C  -1.91822 0.039227 -0.012921
C  -2.474465 -1.076306 -0.693671
C  -2.682858 0.744851 0.952194
C  4.05933 -1.507952 0.858464
C  -3.796079 -1.473512 -0.397824
C  -4.000921 0.330574 1.232234
C  -4.567054 -0.778783 0.561817
H  1.762951 1.360064 -2.014079
H  3.080206 -0.659646 -1.62477
H  3.762597 0.701611 -0.697625
H  2.002909 -1.601753 0.41399
H  2.499736 -0.198304 1.389579
H  2.93341 2.547032 1.037835
H  1.433614 3.485248 1.331108
H  2.309379 3.626851 -0.227934
H  -1.880411 -1.614472 -1.43509
H  -2.238797 1.600799 1.464488
H  -4.221981 -2.334086 -0.925474
H  -4.587113 0.878829 1.978069
H  -5.59172 -1.095564 0.783593
