program: Gaussian 09
title: 000025042
version: EM64L-G09RevD.01
frameworkgroup: C1[X(C7H14O)]
method: RPBEPBE
basis: SDD
operation: Freq
keyword: #pfreq=noraman
keyword: PBEPBE/SDD
title: #p freq=noraman PBEPBE/SDD
converged: YES YES NO NO
title: Mulliken charges:
elementType: O C C C C C C C H H H H H H H H H H H H H H
charge: -0.264641 0.394605 -0.376058 -0.376151 -0.474242 -0.474387 -0.707615 -0.707432 0.206642 0.203683 0.206670 0.203648 0.211425 0.213969 0.211502 0.213929 0.220672 0.215752 0.220849 0.215605 0.220893 0.220681
chargesum: 0.00000
title: Mulliken charges with hydrogens summed into heavy atoms:
elementType: O C C C C C C C
charge: -0.264641 0.394605 0.034268 0.034167 -0.048847 -0.048956 -0.050342 -0.050254
polarizability: 7.77828737e+01 5.90931245e-03 7.76198939e+01 -2.12211696e-03 2.74502350e+00 7.13615139e+01
1716.lowfreq: -23.9303 -21.8844 -0.0005 -0.0004 0.0005 24.1950 63.9333 85.8854 135.7323
frequency: 62.6174 85.1461 135.4836 190.7714 199.5254 225.7235 283.8447 341.4768 381.8131 383.6239 480.7787 627.9350 769.6762 785.5595 800.5178 857.4254 887.5751 918.1601 943.7696 958.5066 982.6703 1001.3852 1046.5021 1053.7290 1072.9626 1082.4162 1092.0346 1152.2748 1188.2057 1242.1421 1269.2327 1270.9950 1309.9867 1326.7488 1334.2457 1354.4345 1385.7066 1388.4696 1466.5634 1467.2529 1475.5209 1480.0851 1480.6255 1487.3434 1490.4217 1496.1013 2972.8309 2974.0925 2975.4345 2977.0431 2977.7246 2988.2067 3020.5526 3021.6675 3043.1374 3047.4234 3068.5024 3069.9760 3076.4532 3077.9446
redmass: 3.7529 2.4512 2.0736 1.3678 2.1977 1.0902 1.7014 1.9955 2.1096 3.0898 2.5547 2.8407 1.1954 1.9701 1.8042 1.6718 4.0292 5.8613 1.3219 2.2397 2.2685 1.3732 2.7905 1.6853 2.0850 1.1917 1.0429 2.6188 2.1063 1.7129 1.2465 1.1775 1.6214 1.3770 1.5985 1.6895 1.2155 1.2069 1.0713 1.0564 1.0504 1.0580 1.0563 1.0585 1.0845 1.0885 1.0591 1.0481 1.0454 1.0485 1.0445 1.0588 1.1005 1.1005 1.1091 1.1117 1.0996 1.0995 1.0993 1.0997
irintensity: 8.7519 0.0054 0.7024 0.2065 0.0147 0.0089 0.2760 0.0112 0.2294 0.6964 2.1065 0.0190 7.2532 0.9280 23.1479 5.3186 2.5615 39.4381 0.6668 8.6138 2.3495 6.7863 0.3617 0.6327 0.9389 0.0895 0.0615 2.5026 0.1538 0.1962 3.8076 0.7010 0.1954 2.4596 0.0464 0.1091 24.8150 10.3310 8.9396 3.0118 5.4011 15.0754 14.6131 4.8730 8.1616 0.0688 19.1363 12.5313 20.3879 25.2766 165.7321 0.0231 17.3880 18.1354 0.3182 93.9170 46.0819 58.3070 90.2698 17.7200
temp: 298.150 k
press: 1.00000 atm
elementType: 8 6 6 6 6 6 6 6 1 1 1 1 1 1 1 1 1 1 1 1 1 1
symmnumber: 1
zpe: 514447.9 jmol-1
zpe.correction: 0.195943 hartree
zpe.thermalcorrener: 0.205423 hartree
zpe.thermalcorrenthalpy: 0.206368 hartree
zpe.thermalcorrgfe: 0.161653 hartree
zpe.sumelectzpe: -349.653511 hartree
zpe.sumelectthermal: -349.644030 hartree
zpe.sumelectthermalent: -349.643086 hartree
zpe.sumelectthermalfe: -349.687801 hartree
dipole: 2.7286 0.0019 0.0014
dipole: 2.7286
quadrupole: -60.8389 -49.2171 -49.0906
quadrupole: -0.0184 -0.0001 0.5305
quadrupole: -7.7900 3.8318 3.9583 -0.0184 -0.0001 0.5305
hfenergy: -349.8494537 hartree
pointgroup: C01 [X(C7H14O1)]
dipole: -1.071408 0.0492363 -0.0455018 debye
dipolederiv: -0.4795007 -0.0051244 0.0090602 -0.0042335 -0.4492818 0.1432608 0.009512 0.1492109 -0.5397128 0.0744023 -0.0042393 0.0063117 -0.0026789 0.0812498 0.0681024 0.0085614 0.1103224 0.0011312 0.1030969 -0.1192826 0.1482221 -0.0462968 0.3455431 -0.074559 0.0224779 -0.0939458 0.4166663 0.1379361 0.1468603 -0.1785895 0.0713817 0.327668 -0.0548208 -0.054866 -0.0793391 0.3999831 0.100618 -0.0073217 0.0187681 -0.009966 0.0904463 -0.0165892 0.0195722 -0.0322352 0.0707968 0.1053001 0.0092265 -0.0171501 0.0101785 0.0882311 -0.0138765 -0.0200971 -0.0304776 0.0672846 -0.0091853 -0.0828368 0.0453617 -0.0835639 0.0239168 0.0250697 0.027367 0.0256654 0.032521 0.012821 0.0808126 -0.0450096 0.0821097 0.0082309 0.0370326 -0.0270365 0.0363332 0.0258007 0.0386046 0.0266683 -0.0138714 0.0336777 0.033317 -0.0883244 0.0126735 -0.0264765 -0.206125 0.0401033 -0.0072746 -0.0238596 -0.0234308 -0.2253306 0.0600498 -0.0257843 -0.0026091 0.0379905 0.0322087 -0.0243668 0.0256094 -0.0261042 0.0387212 -0.0923539 0.004867 -0.0277555 -0.2048154 0.0359761 -0.01696 0.0291917 -0.0060537 -0.2259301 0.0580675 0.0253031 -0.0059499 0.0424272 -0.0578899 0.0852742 0.0994169 0.063443 -0.0617631 -0.0808669 0.0735864 -0.0555915 0.0134875 -0.0186492 0.0118692 -0.0883035 0.0218625 0.0042485 0.1238928 -0.0825682 0.1039807 -0.0699935 -0.0560449 -0.0805418 -0.1119755 -0.056838 -0.0481175 -0.0756443 -0.083937 -0.0545225 -0.0016293 -0.0377145 -0.0169838 0.1023731 -0.0285425 0.0083693 0.112791 0.0947747 0.0942976 -0.0548395 0.0057582 -0.1078825 -0.0524009 -0.1207538 -0.0600209 -0.0827819 -0.0729085 -0.1154317 0.015283 0.0311151 0.0780804 -0.098033 0.0371309 0.0390863 0.0815861 -0.0590115 0.1065316 -0.070196 -0.0373326 0.0949191 0.0756764 0.1352174 -0.0042069 -0.0583833 0.0815928 -0.0411746 0.0338952 0.0052841 -0.0823555 0.1132269 -0.0397484 0.0529339 0.0661399 0.0764573 0.0914396 -0.05772 -0.046671 -0.0869463 -0.0866756 -0.126064 0.0172932 -0.0602523 -0.0900589 -0.0394359 0.0215635 0.0197638 0.1084055 0.0426504 0.119273 -0.0846043 -0.0775401 0.0595227 -0.1128365 0.0262011 unknown
polarizability: 77.7814408|0.1018039|77.5807679|0.1396273|-2.7852848|71.4020728 unknown
InChI: InChI=1S/C7H14O/c1-3-7(4-2)5-8-6-7/h3-6H2,1-2H3
charge 0 multiplicity 1
22 atoms
O  2.314607 -0.100828 0.116584
C  0.103023 0.001958 0.024163
C  1.312645 0.576616 -0.790241
C  1.182275 -0.680093 0.93316
C  -0.75414 -0.999782 -0.785074
C  -0.719477 1.083894 0.763801
C  -1.783065 -1.785273 0.057804
C  -1.594874 1.959082 -0.160539
H  1.408844 0.209762 -1.829848
H  1.433962 1.676088 -0.763755
H  1.224999 -0.321161 1.979053
H  1.203115 -1.786115 0.910463
H  -0.068358 -1.715353 -1.282152
H  -1.278673 -0.460445 -1.599191
H  -0.01218 1.733555 1.317829
H  -1.358247 0.599912 1.529444
H  -2.295801 -2.545907 -0.558382
H  -1.29485 -2.312253 0.899902
H  -2.558769 -1.121519 0.481055
H  -0.989521 2.421602 -0.96333
H  -2.398402 1.372043 -0.641082
H  -2.074013 2.775618 0.40934
