program: Gaussian 09
title: 000276381
version: EM64L-G09RevD.01
frameworkgroup: C1[X(C9H18N2)]
method: RPBEPBE
basis: SDD
operation: Freq
keyword: #pfreq=noraman
keyword: PBEPBE/SDD
title: #p freq=noraman PBEPBE/SDD
converged: YES YES NO NO
title: Mulliken charges:
elementType: N N C C C C C C C C C H H H H H H H H H H H H H H H H H H
charge: -0.355579 -0.355588 -0.092920 -0.092924 -0.504728 -0.504732 -0.413628 -0.413538 -0.405366 -0.405426 -0.329144 0.229398 0.229349 0.220718 0.228555 0.220696 0.228565 0.210677 0.193186 0.193167 0.210698 0.256530 0.256536 0.190692 0.194909 0.190594 0.194962 0.212293 0.212047
chargesum: 0.00000
title: Mulliken charges with hydrogens summed into heavy atoms:
elementType: N N C C C C C C C C C
charge: -0.099049 -0.099052 0.136478 0.136425 -0.055454 -0.055471 -0.009766 -0.009673 -0.019764 -0.019870 0.095196
polarizability: 1.22912200e+02 -2.57213537e-03 1.12452859e+02 3.51382574e+00 1.43221255e-03 8.78583126e+01
1716.lowfreq: -13.8987 -3.0803 -0.0003 0.0006 0.0007 7.1611 32.2818 55.7461 63.0115
frequency: 31.8115 55.6830 62.6648 93.6405 99.7563 125.1359 195.9943 215.8188 240.4142 281.2244 329.5521 378.1308 393.7103 490.9610 507.6287 719.2569 721.7036 726.8904 757.2936 784.5503 810.9470 835.9738 847.2645 880.8711 889.6029 921.8277 922.4372 944.8704 977.0315 1009.0201 1018.3024 1048.0827 1051.9486 1081.8157 1091.1542 1101.7286 1104.1110 1108.9589 1121.9212 1184.0352 1194.5541 1197.9299 1217.5450 1221.6534 1239.0411 1239.8576 1251.5771 1259.7248 1290.2599 1299.2933 1314.0682 1318.4885 1343.6598 1365.9251 1406.3386 1406.7359 1448.2507 1449.8132 1460.7354 1467.0640 1475.3112 1476.1595 1482.0246 2949.0684 2953.0993 2973.5414 2974.6002 2990.6176 2997.7958 3003.7929 3033.9311 3035.6828 3053.6001 3062.7892 3064.3066 3070.5746 3070.7014 3168.4746 3168.5102 3349.1338 3349.1581
redmass: 4.2783 3.3679 2.5783 4.0046 2.8278 1.9187 3.0008 2.0722 2.1222 3.5059 3.1388 2.5995 2.2908 2.1605 2.4837 1.2930 3.3849 3.1984 2.1387 2.8362 2.2344 1.7749 1.8337 1.3601 1.5047 1.1380 1.7512 1.2485 1.3705 2.6248 1.2211 1.2153 2.1343 2.3838 1.9024 1.4365 1.5035 1.2573 1.1051 1.6147 1.6260 1.8377 1.3934 1.5049 1.3917 1.4216 1.2869 1.3425 1.1428 1.1948 1.2827 1.2935 1.3725 1.5627 1.8937 1.8899 1.0793 1.0856 1.0779 1.0894 1.1701 1.1958 1.1180 1.0598 1.0600 1.0629 1.0626 1.0635 1.0965 1.0964 1.0988 1.0983 1.0993 1.0768 1.0760 1.0676 1.0713 1.1168 1.1168 1.0777 1.0776
irintensity: 1.5464 0.6745 9.6088 0.0824 0.5891 2.4615 1.5968 5.2221 0.6412 0.2596 7.1542 0.0647 18.2770 4.7419 4.5867 7.7982 6.2796 19.4639 29.2508 42.1974 9.0792 3.3720 0.6202 50.0067 1.9173 19.5614 0.2682 6.2632 0.2029 1.0532 1.7842 1.1660 1.3123 0.9892 1.6586 0.1825 23.0545 5.3117 19.2267 4.8662 8.7055 18.4360 8.1623 5.5074 2.6147 17.8432 0.4928 0.7085 0.0179 0.2498 0.8560 0.3527 2.8837 3.3460 0.8718 2.5978 0.2301 20.3068 0.0413 0.1167 0.6077 2.0529 18.1516 7.8914 56.9038 66.5622 26.9971 21.9717 38.1319 47.1815 16.0904 11.7289 33.0140 16.4658 82.8286 0.9052 100.5030 3.1863 42.4802 10.6836 1.2100
temp: 298.150 k
press: 1.00000 atm
elementType: 7 7 6 6 6 6 6 6 6 6 6 1 1 1 1 1 1 1 1 1 1 1 1 1 1 1 1 1 1
symmnumber: 1
zpe: 677439.9 jmol-1
zpe.correction: 0.258023 hartree
zpe.thermalcorrener: 0.270588 hartree
zpe.thermalcorrenthalpy: 0.271532 hartree
zpe.thermalcorrgfe: 0.217821 hartree
zpe.sumelectzpe: -462.250300 hartree
zpe.sumelectthermal: -462.237735 hartree
zpe.sumelectthermalent: -462.236791 hartree
zpe.sumelectthermalfe: -462.290502 hartree
dipole: 0.0034 0.5925 0.0019
dipole: 0.5925
quadrupole: -61.7469 -69.6322 -66.5209
quadrupole: -0.0056 -5.9560 -0.0044
quadrupole: 4.2198 -3.6655 -0.5542 -0.0056 -5.9560 -0.0044
hfenergy: -462.5083234 hartree
pointgroup: C01 [X(C9H18N2)]
dipole: -0.0016617 -0.2330916 -0.0009664 debye
polarizability: 122.6598747|0.0173811|112.4514061|-4.5964405|0.1900502|88.1120917 unknown
InChI: InChI=1S/C9H18N2/c1(2-4-8-6-10-8)3-5-9-7-11-9/h8-11H,1-7H2
charge 0 multiplicity 1
29 atoms
N  -2.17884 1.54507 0.09894
N  2.188128 1.540314 -0.085535
C  -2.796427 0.224323 -0.35134
C  2.800604 0.211159 0.346615
C  -3.691065 1.369255 0.081481
C  3.699758 1.359331 -0.067867
C  -2.529432 -0.975579 0.544648
C  2.531321 -0.974915 -0.566933
C  -1.279564 -1.789011 0.122204
C  1.278512 -1.790526 -0.157693
C  0.000556 -0.933527 -0.012664
H  -2.776137 0.010382 -1.431277
H  2.777659 -0.01835 1.423303
H  -4.284306 1.882811 -0.686084
H  -4.152995 1.340981 1.074393
H  4.293165 1.859672 0.708249
H  4.163516 1.344143 -1.060215
H  -2.397196 -0.599769 1.577952
H  -3.420355 -1.636924 0.545996
H  3.42025 -1.638866 -0.576435
H  2.401776 -0.583958 -1.594937
H  -1.85465 2.110846 -0.709135
H  1.864288 2.095263 0.730154
H  -1.478586 -2.302019 -0.842761
H  -1.111349 -2.593099 0.868738
H  1.474717 -2.317318 0.80042
H  1.10917 -2.583898 -0.915385
H  0.087582 -0.266593 0.866257
H  -0.084799 -0.255801 -0.883485
