program: Gaussian 09
title: 000276383
version: EM64L-G09RevD.01
frameworkgroup: C1[X(C13H26N2O2)]
method: RPBEPBE
basis: SDD
operation: Freq
keyword: #p
keyword: freq=noraman
keyword: PBEPBE/SDD
title: #p freq=noraman PBEPBE/SDD
converged: YES YES NO NO
title: Mulliken charges:
elementType: O O N N C C C C C C C C C C C C C H H H H H H H H H H H H H H H H H H H H H H H H H H
charge: -0.442038 -0.442023 -0.136432 -0.136472 -0.057845 -0.058199 -0.493015 -0.492927 -0.431285 -0.431086 -0.382397 -0.382500 -0.379542 -0.383314 -0.383080 -0.327413 -0.327619 0.230120 0.230181 0.233522 0.215294 0.233512 0.215261 0.207986 0.191511 0.191349 0.207996 0.211995 0.193060 0.212313 0.192842 0.193710 0.193517 0.192333 0.211732 0.192320 0.211779 0.224197 0.205034 0.224268 0.205047 0.333141 0.333166
chargesum: 0.00000
title: Mulliken charges with hydrogens summed into heavy atoms:
elementType: O O N N C C C C C C C C C C C C C
charge: -0.108896 -0.108857 -0.136432 -0.136472 0.172274 0.171982 -0.044198 -0.044155 -0.031788 -0.031741 0.022658 0.022655 0.007685 0.020751 0.021019 0.101818 0.101696
polarizability: 1.91954054e+02 2.21499829e-02 1.64922597e+02 -2.12813554e+00 -1.22052048e-02 1.27599989e+02
1716.lowfreq: -7.7601 -3.5509 -2.9497 -0.0008 -0.0005 0.0001 11.8865 21.5025 26.0362
frequency: 11.6700 21.4781 25.9006 48.1145 60.0262 79.1761 82.0440 92.4755 101.4686 106.5621 122.5939 130.0270 143.3970 183.7117 201.8155 258.9155 285.3171 290.0731 295.4667 315.2274 323.9496 364.5860 368.8535 402.7017 404.4911 440.8265 468.3482 500.1188 517.2669 704.8222 704.9636 728.9524 760.3400 796.4975 797.6795 815.0818 815.7832 830.2404 866.8957 869.1019 932.7019 962.2817 963.5597 988.2499 994.6883 1013.8601 1019.1923 1028.8275 1039.5602 1046.9712 1051.8788 1060.5485 1064.0917 1077.7905 1083.6303 1083.7055 1089.6627 1089.7925 1100.7525 1125.4011 1132.6734 1155.6839 1158.6630 1179.2190 1194.6536 1221.4102 1234.3269 1238.7455 1244.1862 1269.0900 1276.2917 1277.8225 1280.1661 1286.2136 1292.5710 1293.7228 1295.2675 1311.6652 1342.3760 1347.5548 1347.8311 1353.3736 1380.6703 1380.9365 1395.9207 1396.2980 1450.2297 1451.6626 1462.3520 1463.7826 1463.9135 1469.8483 1470.0572 1470.1465 1481.8415 1482.1078 1482.7870 2899.6535 2899.9629 2950.0409 2955.1096 2961.2521 2969.6236 2971.3033 2983.1782 2983.2903 2990.2028 3003.2468 3003.4684 3008.0381 3019.5916 3029.6898 3035.4396 3046.6773 3050.3378 3055.2320 3055.9269 3085.8842 3085.9916 3161.9241 3162.1946 3563.3933 3563.5050
redmass: 5.2655 5.5660 3.6699 5.0789 2.8815 2.0475 4.4005 2.2456 2.4154 2.1638 2.6544 2.6084 2.0607 3.1279 3.2532 3.3445 1.9673 2.2173 2.3490 1.2295 1.5105 4.1070 3.4074 4.3892 3.3141 2.6125 2.5820 3.0569 2.8482 2.4915 2.4801 1.1987 1.4292 3.7990 3.9799 1.1200 1.1246 1.3264 1.6875 1.8506 1.5143 3.3129 3.1745 3.1183 2.1986 1.5943 2.0588 2.0853 1.4812 1.5102 1.5782 1.8775 2.2809 2.2203 2.4336 2.1937 1.3140 1.3161 2.3082 1.6635 1.5587 1.9110 1.6140 1.5530 1.6960 1.2870 1.6280 1.7811 1.5241 1.3054 1.1672 1.1892 1.1916 1.0862 1.2001 1.2382 1.1504 1.3514 1.4706 1.2627 1.2509 1.6382 1.2962 1.2908 1.9982 2.0192 1.0791 1.0867 1.0686 1.1073 1.1043 1.0978 1.1362 1.1354 1.0943 1.0887 1.0957 1.0664 1.0664 1.0592 1.0603 1.0601 1.0620 1.0618 1.0668 1.0667 1.0958 1.0917 1.0917 1.0966 1.0971 1.0915 1.0911 1.0888 1.0844 1.0654 1.0730 1.0996 1.0996 1.1151 1.1151 1.0663 1.0663
irintensity: 0.0082 0.1440 0.9869 0.1633 0.0001 1.1627 5.0926 5.4815 1.5987 5.4791 2.1961 4.0673 0.3558 3.3884 0.0509 0.0012 59.3641 10.0610 8.7751 37.4937 218.4522 2.0933 8.6680 8.3795 1.3286 4.8804 0.1806 0.4867 1.4569 1.0826 0.7588 16.5147 0.2724 0.1438 18.4652 8.7795 2.4480 1.4274 7.8118 5.3292 17.0137 15.5161 119.5203 14.6034 81.4588 2.9694 21.6803 5.0985 8.4766 2.8675 5.3933 20.0022 6.5978 0.9019 0.5179 1.3401 2.6677 14.4361 1.2012 2.2775 38.6932 1.2381 0.0079 4.5493 8.3025 6.1512 5.9310 24.6896 4.4536 1.9389 0.7573 3.4679 0.1083 0.4277 2.5590 7.0320 0.0042 5.9210 5.9812 10.6828 31.4417 5.3391 1.4978 2.4217 11.8015 13.1060 0.4801 7.4242 0.0829 4.6377 0.3974 0.3671 0.1187 8.0816 6.1504 15.2782 11.8609 77.7548 64.0433 2.7940 2.1443 32.0794 7.4514 129.1507 90.2652 31.8384 0.7033 27.8484 40.1374 4.7750 8.6859 11.1705 4.5645 15.8594 107.9894 8.4421 137.1216 68.7196 9.5807 22.9316 23.8978 5.4797 6.7362
temp: 298.150 k
press: 1.00000 atm
elementType: 8 8 7 7 6 6 6 6 6 6 6 6 6 6 6 6 6 1 1 1 1 1 1 1 1 1 1 1 1 1 1 1 1 1 1 1 1 1 1 1 1 1 1
symmnumber: 1
zpe: 987423.6 jmol-1
zpe.correction: 0.376090 hartree
zpe.thermalcorrener: 0.396957 hartree
zpe.thermalcorrenthalpy: 0.397901 hartree
zpe.thermalcorrgfe: 0.322422 hartree
zpe.sumelectzpe: -769.401073 hartree
zpe.sumelectthermal: -769.380206 hartree
zpe.sumelectthermalent: -769.379262 hartree
zpe.sumelectthermalfe: -769.454741 hartree
dipole: -0.0009 -2.4727 0.0059
dipole: 2.4727
quadrupole: -82.7162 -119.6058 -102.2726
quadrupole: 0.0166 -0.6477 0.0230
quadrupole: 18.8153 -18.0742 -0.7411 0.0166 -0.6477 0.0230
hfenergy: -769.7771626 hartree
pointgroup: C01 [X(C13H26N2O2)]
dipole: 0.0029182 0.9727047 -0.0164343 debye
polarizability: 191.9961071|-0.0226628|164.9091141|1.3484641|-0.71151|127.571418 unknown
InChI: InChI=1S/C13H26N2O2/c16-8-6-14-10-12(14)4-2-1-3-5-13-11-15(13)7-9-17/h12-13,16-17H,1-11H2
charge 0 multiplicity 1
43 atoms
O  4.465889 -3.386802 0.679159
O  -4.488898 -3.383826 -0.547984
N  4.51614 0.373154 0.228461
N  -4.514509 0.390583 -0.23781
C  3.72649 0.866959 -0.967295
C  -3.716652 0.922427 0.936094
C  5.143921 1.361967 -0.72873
C  -5.131609 1.41811 0.684881
C  2.501579 1.718108 -0.679174
C  -2.487446 1.754661 0.613401
C  1.253522 0.871882 -0.337362
C  -1.246278 0.889641 0.294578
C  0.006264 1.731333 -0.035088
C  5.035626 -1.019127 0.14404
C  -5.042249 -0.99429 -0.09968
C  3.994586 -1.993523 0.727157
C  -4.01029 -1.996074 -0.651683
H  3.609212 0.144407 -1.792394
H  -3.601114 0.229572 1.786545
H  5.310027 2.36562 -0.322551
H  5.930863 0.997936 -1.404893
H  -5.292294 2.407359 0.242745
H  -5.918325 1.085171 1.37721
H  2.731652 2.395102 0.166417
H  2.288212 2.358067 -1.560629
H  -2.265622 2.422387 1.471894
H  -2.717214 2.404717 -0.253186
H  1.485432 0.23496 0.540155
H  1.028827 0.184118 -1.17962
H  -1.484367 0.228136 -0.562806
H  -1.024376 0.226119 1.156828
H  -0.212245 2.384475 -0.905972
H  0.22881 2.410204 0.814828
H  5.287912 -1.339641 -0.895326
H  5.967128 -1.066083 0.74414
H  -5.290937 -1.274521 0.952087
H  -5.977182 -1.057283 -0.692889
H  3.075572 -1.991682 0.118025
H  3.733142 -1.683946 1.759726
H  -3.087536 -1.976161 -0.048592
H  -3.75354 -1.727569 -1.696846
H  5.239275 -3.485689 1.289859
H  -5.266101 -3.501564 -1.150418
