program: Gaussian 09
title: 000276387
version: EM64L-G09RevD.01
frameworkgroup: C1[X(C13H15N3O2)]
method: RPBEPBE
basis: SDD
operation: Freq
keyword: #p
keyword: freq=noraman
keyword: PBEPBE/SDD
title: #p freq=noraman PBEPBE/SDD
converged: YES YES NO NO
title: Mulliken charges:
elementType: O O N N N C C C C C C C C C C C C C H H H H H H H H H H H H H H H
charge: -0.212592 -0.245721 -0.320569 -0.284733 -0.268348 -0.060498 0.283396 0.164704 -0.417526 -0.468403 -0.345275 0.204841 -0.406722 -0.311383 0.217004 -0.246365 -0.214059 -0.753262 0.268441 0.278490 0.231529 0.216735 0.228889 0.252363 0.204884 0.196742 0.267551 0.312044 0.230792 0.231134 0.247933 0.258840 0.259145
chargesum: 0.00000
title: Mulliken charges with hydrogens summed into heavy atoms:
elementType: O O N N N C C C C C C C C C C C C C
charge: -0.212592 -0.245721 -0.052127 -0.006243 -0.268348 -0.060498 0.283396 0.164704 0.030738 0.012849 0.056351 0.204841 -0.139171 0.000661 0.217004 -0.015573 0.017075 0.012656
polarizability: 2.04886653e+02 5.97447113e+00 1.89082113e+02 1.63231668e+00 1.47765485e-01 1.00732582e+02
1716.lowfreq: -16.9203 -7.4954 -0.0007 -0.0005 -0.0004 6.8704 39.5900 58.3556 84.4703
frequency: 39.5413 58.3270 84.4075 99.0094 119.8013 159.7202 181.8523 199.4908 238.2168 252.6846 273.4533 300.3000 338.5709 341.4451 343.4209 377.9870 411.4597 427.6709 480.9007 487.8551 513.4820 537.6518 556.8055 575.1221 588.9544 604.5270 671.5024 683.9153 693.8453 720.5296 758.6578 773.8134 823.2082 846.4701 888.2614 892.6718 899.1903 901.8694 939.0347 961.9944 982.2877 997.3014 1007.0449 1018.1426 1030.1460 1037.9408 1072.7055 1084.0473 1104.2284 1119.3849 1129.5513 1141.9817 1168.9515 1198.1047 1204.8741 1231.5253 1256.1599 1274.7245 1289.3249 1304.3659 1339.9695 1348.2825 1352.0532 1389.5184 1400.2598 1428.8328 1430.8397 1436.3334 1448.2414 1449.6954 1454.1381 1462.8115 1472.4269 1481.7180 1596.6411 1613.4566 1622.5031 1648.9262 2940.9368 2984.8050 3007.6595 3009.6180 3034.6504 3051.1665 3072.0481 3097.1532 3133.6153 3135.1649 3145.9537 3164.6922 3216.1114 3450.0032 3454.2539
redmass: 5.9020 3.7279 4.2780 3.6174 4.6766 3.1347 1.1456 4.7153 3.3950 2.9606 5.1376 3.3224 3.3668 4.0594 4.1380 3.0076 5.1872 3.2740 5.9254 3.7459 1.7991 2.8513 2.4862 4.3297 2.2631 2.3403 4.5162 6.0727 3.1165 6.1100 3.9017 1.3419 3.5014 3.0350 1.4135 1.4855 2.9752 4.7832 2.5222 1.4263 2.6137 1.3104 2.5716 4.1136 1.8280 1.7000 2.0322 3.0216 4.5232 4.0949 1.9548 1.9254 1.1281 2.7738 1.3196 1.5991 2.2247 1.9872 1.9791 1.9672 1.3828 1.2576 1.3649 1.2447 5.7721 1.3025 1.1038 1.2869 1.2160 1.0497 1.9499 1.0832 3.0300 1.1032 7.3220 8.1455 8.1730 10.5680 1.0670 1.0603 1.0617 1.0361 1.0943 1.1017 1.1054 1.0961 1.0861 1.1026 1.0919 1.0990 1.0945 1.0754 1.0751
irintensity: 0.6592 5.7285 2.9098 0.9123 0.1181 1.2309 1.1033 4.0908 1.6510 3.3803 6.5309 5.3066 1.1044 3.1491 12.1682 8.5923 5.1792 19.8298 1.9210 22.3618 24.6580 35.3372 28.0989 23.5887 64.9279 46.3937 5.9676 20.9849 24.8553 11.1857 1.8134 88.7073 36.4758 5.3886 2.2545 9.5472 15.3823 22.6612 4.6438 3.7341 8.2623 1.4334 45.3409 12.0526 16.6706 7.4341 15.2167 41.1953 68.6270 97.9897 7.4939 42.7087 2.0686 46.3949 33.6682 6.5966 20.6800 100.3796 190.3693 115.5636 5.1625 13.8229 21.5745 44.9789 31.1645 31.5903 46.2430 17.9143 1.9707 19.4302 57.6602 13.0629 67.4517 8.3374 49.3576 93.9711 104.6164 166.1123 50.7226 37.0630 36.7282 1.9971 51.1082 47.3044 33.0010 4.8846 1.2278 17.0162 14.4276 23.3577 4.0683 1.5725 3.0534
temp: 298.150 k
press: 1.00000 atm
elementType: 8 8 7 7 7 6 6 6 6 6 6 6 6 6 6 6 6 6 1 1 1 1 1 1 1 1 1 1 1 1 1 1 1
symmnumber: 1
zpe: 693683.9 jmol-1
zpe.correction: 0.264210 hartree
zpe.thermalcorrener: 0.279817 hartree
zpe.thermalcorrenthalpy: 0.280762 hartree
zpe.thermalcorrgfe: 0.221697 hartree
zpe.sumelectzpe: -817.781458 hartree
zpe.sumelectthermal: -817.765850 hartree
zpe.sumelectthermalent: -817.764906 hartree
zpe.sumelectthermalfe: -817.823971 hartree
dipole: -2.8138 2.1511 -0.7263
dipole: 3.6155
quadrupole: -106.2418 -99.0210 -104.4091
quadrupole: 2.9474 -1.3003 0.9022
quadrupole: -3.0178 4.2030 -1.1851 2.9474 -1.3003 0.9022
hfenergy: -818.0456679 hartree
pointgroup: C01 [X(C13H15N3O2)]
dipole: 1.072719 -0.8689004 -0.3430508 debye
polarizability: 205.0934589|5.6127403|188.6381571|-4.0717332|2.7989878|100.969732 unknown
InChI: InChI=1S/C13H15N3O2/c1-9(17)16-11-6-3-2-5-10(11)13(12(16)18)14-7-4-8-15-13/h2-3,5-6,14-15H,4,7-8H2,1H3
charge 0 multiplicity 1
33 atoms
O  1.064674 2.205203 -0.232159
O  -3.176932 1.865755 0.198543
N  1.905558 -0.648116 -1.232784
N  1.740075 -0.426293 1.201972
N  -1.011746 1.024965 0.010771
C  1.027491 -0.31797 -0.088379
C  -0.222989 -1.174137 -0.083963
C  0.423577 1.133798 -0.110872
C  3.211266 0.065064 -1.281909
C  3.069901 0.241348 1.237491
C  3.967762 -0.171941 0.04434
C  -1.38621 -0.372618 0.01163
C  -0.311168 -2.571534 -0.15233
C  -2.668606 -0.955013 0.067722
C  -1.941632 2.106975 0.114559
C  -1.592258 -3.175639 -0.098877
C  -2.748629 -2.369353 0.015878
C  -1.392813 3.519162 0.12936
H  1.402349 -0.666366 -2.129108
H  1.773332 -1.407138 1.509991
H  3.093409 1.158847 -1.445688
H  3.787647 -0.34775 -2.130012
H  3.545261 -0.005072 2.203447
H  2.907687 1.334227 1.216842
H  4.233745 -1.243692 0.127171
H  4.90428 0.418151 0.048185
H  0.5977 -3.17271 -0.261102
H  -3.560513 -0.334057 0.145237
H  -1.688055 -4.265299 -0.150615
H  -3.735951 -2.842579 0.059131
H  -2.247156 4.201154 0.254265
H  -0.850468 3.752909 -0.802176
H  -0.664986 3.663516 0.945838
