program: Gaussian 09
title: 000276376
version: EM64L-G09RevD.01
frameworkgroup: C1[X(C14H22O)]
method: RPBEPBE
basis: SDD
operation: Freq
keyword: #pfreq=noraman
keyword: PBEPBE/SDD
title: #p freq=noraman PBEPBE/SDD
converged: YES YES NO NO
title: Mulliken charges:
elementType: O C C C C C C C C C C C C C C H H H H H H H H H H H H H H H H H H H H H H
charge: -0.194104 -0.113649 -0.187465 -0.457352 -0.422648 -0.417977 -0.412412 -0.364932 -0.408996 0.116468 -0.176328 -0.474883 -0.391007 -0.475416 -0.194793 0.225868 0.206031 0.217605 0.204967 0.212240 0.195238 0.207615 0.194274 0.196855 0.207322 0.201387 0.192803 0.193783 0.200151 0.221216 0.230028 0.205851 0.208992 0.237199 0.199593 0.206433 0.210043
chargesum: 0.00000
title: Mulliken charges with hydrogens summed into heavy atoms:
elementType: O C C C C C C C C C C C C C C
charge: -0.194104 0.112219 0.018566 -0.034780 -0.015170 -0.016088 -0.008235 0.029258 -0.015061 0.116468 0.044888 -0.039004 0.055184 -0.069389 0.015250
polarizability: 1.79335368e+02 2.15572919e+00 1.36272866e+02 2.78244417e+00 -8.31423506e-01 1.22474861e+02
1716.lowfreq: -20.9873 -6.1526 -0.0008 -0.0007 0.0005 12.9804 60.7988 77.0627 110.2251
frequency: 60.1027 76.8198 110.1923 126.9211 158.6796 176.2774 213.2362 219.8688 255.2367 269.0903 278.5407 297.7287 329.8262 372.0139 394.2853 421.0281 438.2436 460.2970 520.3276 534.4620 551.9727 596.5753 686.4379 720.3854 734.0139 741.6295 779.1045 797.8536 820.4625 836.2791 867.2279 874.4393 905.8070 933.2068 949.0320 964.4177 975.4709 981.5840 999.0543 1017.4787 1046.2369 1051.6615 1070.2341 1080.7733 1100.2871 1117.4383 1123.5631 1135.1774 1146.4217 1174.6491 1186.6765 1201.4350 1209.5839 1220.6135 1244.4281 1254.2594 1257.6637 1269.1313 1273.4163 1289.4129 1292.0463 1307.6439 1313.6179 1318.0916 1330.6779 1337.7597 1339.0231 1341.7835 1356.6081 1366.4594 1367.3586 1389.5604 1457.1973 1459.4207 1461.9474 1463.0894 1468.9988 1470.8847 1472.4179 1481.3206 1503.8847 1614.6916 1663.2547 2954.5903 2956.8050 2959.8402 2968.5445 2972.2593 2972.8732 2977.9678 2982.4706 2986.5684 2991.3882 3005.3597 3007.3230 3010.1642 3021.9259 3029.0221 3034.5738 3035.3551 3044.9448 3048.9769 3057.6575 3070.4287 3109.1399
redmass: 3.7825 3.3066 5.2533 2.4252 3.1548 2.6155 4.1056 2.9880 2.5437 2.7062 2.1884 2.6101 2.0526 2.4752 2.5420 2.0280 2.3685 3.7041 2.2784 2.8424 2.3992 2.4820 3.2959 1.6264 1.8738 1.9622 1.8601 1.8379 2.1462 2.5434 2.0812 1.6911 2.6047 2.1138 1.8302 2.2342 1.5737 1.7100 2.2798 2.4256 2.0973 2.2057 2.4868 2.3014 2.2377 1.8000 1.5155 1.6944 2.1801 1.3764 1.2070 1.3124 1.3587 1.3846 1.2424 1.2298 1.2657 1.2070 1.1897 1.1686 1.1672 1.4344 1.3042 1.3340 1.3706 1.3525 1.3553 1.3563 1.3626 1.3847 1.4252 1.4805 1.1037 1.0840 1.0882 1.0810 1.0826 1.0853 1.0966 1.0827 1.0796 8.9971 7.2896 1.0805 1.0603 1.0606 1.0623 1.0628 1.0617 1.0648 1.0607 1.0657 1.0604 1.0963 1.0891 1.0970 1.0993 1.0986 1.0977 1.1000 1.1018 1.0966 1.1025 1.0844 1.0965
irintensity: 1.3818 0.5655 2.9935 0.0644 0.5943 0.7918 0.0567 1.6811 1.4481 0.5605 0.5865 0.0211 0.6861 0.7768 1.9575 1.6160 0.2680 1.5762 1.0317 6.3663 2.9773 4.7791 3.8515 0.5906 9.7779 30.7608 15.3718 9.5554 2.9976 0.2356 6.7928 11.7971 1.1862 1.6496 2.5679 2.1467 1.9960 6.2423 1.5492 2.5900 7.0412 1.8061 1.5953 8.8439 6.0304 0.5210 10.4073 11.4634 0.0101 16.5295 6.0997 7.1554 10.6718 6.5664 1.5507 3.2922 2.8910 1.0138 2.0387 0.9514 0.6861 10.5684 1.8468 14.3036 2.2178 0.8036 8.6058 1.0391 0.0564 2.1036 0.4716 0.4947 10.1081 2.8962 13.9239 7.2970 11.5476 11.7743 13.2619 13.1238 16.9713 128.8911 1.4498 5.1490 31.2263 10.9981 26.3581 48.8458 36.7812 41.8092 39.0829 33.3715 34.3841 22.9925 16.0932 15.1494 76.4728 53.6043 39.2428 66.7971 29.2470 58.1555 53.3523 11.0116 47.8145
temp: 298.150 k
press: 1.00000 atm
elementType: 8 6 6 6 6 6 6 6 6 6 6 6 6 6 6 1 1 1 1 1 1 1 1 1 1 1 1 1 1 1 1 1 1 1 1 1 1
symmnumber: 1
zpe: 865346.2 jmol-1
zpe.correction: 0.329593 hartree
zpe.thermalcorrener: 0.343888 hartree
zpe.thermalcorrenthalpy: 0.344833 hartree
zpe.thermalcorrgfe: 0.289579 hartree
zpe.sumelectzpe: -620.696896 hartree
zpe.sumelectthermal: -620.682601 hartree
zpe.sumelectthermalent: -620.681656 hartree
zpe.sumelectthermalfe: -620.736910 hartree
dipole: 1.2183 -1.6351 -2.5127
dipole: 3.2359
quadrupole: -88.6350 -97.6196 -94.0352
quadrupole: 4.2558 5.2510 -6.1706
quadrupole: 4.7949 -4.1897 -0.6052 4.2558 5.2510 -6.1706
hfenergy: -621.0264888 hartree
pointgroup: C01 [X(C14H22O1)]
dipole: 0.4864366 -0.6461305 -0.9832201 debye
polarizability: 179.2921487|2.1688504|136.267869|3.188921|-0.8553348|122.5230773 unknown
InChI: InChI=1S/C14H22O/c15-14-11-7-3-5-9-12-8-4-1-2-6-10-13(12)14/h5,9,12-13H,1-4,6-8,10-11H2
charge 0 multiplicity 1
37 atoms
O  -1.609273 1.959468 1.296502
C  0.191128 0.621231 0.318738
C  0.029355 -0.920674 0.043861
C  1.122309 1.365273 -0.700946
C  1.319165 -1.779286 0.222614
C  2.532259 1.716544 -0.152634
C  2.476191 -1.531113 -0.787449
C  3.299899 0.587471 0.573375
C  3.658011 -0.66679 -0.258756
C  -1.193687 1.292709 0.309344
C  -1.059146 -1.470693 0.95717
C  -2.05041 1.193288 -0.962935
C  -3.32794 0.321776 -0.780727
C  -3.04027 -1.204155 -0.65731
C  -2.38063 -1.590675 0.657076
H  0.581798 0.759665 1.345949
H  -0.295161 -1.030033 -1.012998
H  0.646067 2.319867 -1.00499
H  1.205099 0.7666 -1.625965
H  0.994086 -2.835198 0.138618
H  1.691272 -1.664267 1.26126
H  2.423712 2.560986 0.558115
H  3.14887 2.09541 -0.993919
H  2.065352 -1.093078 -1.716614
H  2.900039 -2.509032 -1.090434
H  2.729957 0.279748 1.472435
H  4.245984 1.01885 0.959699
H  4.292575 -0.366459 -1.118171
H  4.294004 -1.313502 0.380441
H  -0.726076 -1.746659 1.970136
H  -2.374074 2.223092 -1.20879
H  -1.455736 0.810573 -1.813644
H  -3.986291 0.489378 -1.655761
H  -3.873796 0.677971 0.113218
H  -2.411071 -1.511972 -1.517019
H  -3.998313 -1.748594 -0.756125
H  -3.054158 -1.958822 1.444338
