program: Gaussian 09
title: 000276377
version: EM64L-G09RevD.01
frameworkgroup: C1[X(C14H22O2)]
method: RPBEPBE
basis: SDD
operation: Freq
keyword: #pfreq=noraman
keyword: PBEPBE/SDD
title: #p freq=noraman PBEPBE/SDD
converged: YES YES NO NO
title: Mulliken charges:
elementType: O O C C C C C C C C C C C C C C H H H H H H H H H H H H H H H H H H H H H H
charge: -0.312659 -0.197085 -0.134630 -0.074803 -0.090545 -0.157932 -0.423865 -0.438132 -0.471041 -0.383366 0.134268 -0.434741 -0.501652 -0.439922 -0.394872 -0.354829 0.244889 0.193288 0.228693 0.228602 0.201260 0.231842 0.208016 0.218329 0.253899 0.193955 0.213165 0.231092 0.203937 0.196178 0.209011 0.233521 0.197355 0.206808 0.204841 0.191316 0.193366 0.192443
chargesum: 0.00000
title: Mulliken charges with hydrogens summed into heavy atoms:
elementType: O O C C C C C C C C C C C C C C
charge: -0.312659 -0.197085 0.110259 0.118485 0.138148 0.070670 0.009237 -0.011787 -0.023187 0.060891 0.134268 -0.034627 -0.059120 -0.035758 0.001285 0.030980
polarizability: 1.72273103e+02 -1.75513888e+00 1.40799554e+02 2.85610378e+00 3.40481464e+00 1.25855800e+02
1716.lowfreq: -17.7756 -6.0560 -0.0002 0.0007 0.0009 10.9397 61.1852 97.9579 101.2736
frequency: 60.6926 97.9352 101.2463 113.1353 170.7964 186.6780 207.2277 215.8453 228.9756 252.5799 273.0810 294.1505 332.0625 348.9388 375.1424 390.5953 397.5269 450.5807 472.6290 496.4139 519.6600 539.3539 603.2810 651.4001 719.9382 732.5764 760.0391 773.6464 797.5171 809.7910 833.7482 842.6646 872.4995 879.2024 889.1107 920.9813 956.6860 962.2664 972.1212 995.6713 1010.5926 1026.9220 1030.2129 1058.0324 1068.0848 1082.9045 1100.0359 1108.2718 1126.0860 1131.8936 1135.2204 1139.0943 1173.2026 1179.7056 1200.4165 1209.7319 1224.6767 1232.8103 1239.2615 1256.7145 1266.5760 1278.8512 1289.0563 1291.0313 1307.6327 1313.3273 1325.1422 1331.0271 1336.8601 1340.8913 1347.1334 1354.5224 1359.5892 1365.6330 1377.3825 1429.2177 1454.7617 1460.6805 1462.8816 1464.7267 1466.6681 1472.6791 1477.7025 1491.7708 1498.4872 1615.2059 2953.6703 2957.3206 2967.1390 2972.9948 2976.3985 2983.3419 2986.9344 2987.2485 2992.9145 2994.8181 2999.3316 3004.0382 3014.6887 3023.2108 3030.1553 3035.4686 3041.1240 3045.2405 3049.3911 3059.7598 3060.9960 3085.2657
redmass: 4.2273 4.7772 3.8817 3.5972 3.1696 2.4164 3.7153 2.8081 3.2759 2.5630 2.6444 3.1411 3.2004 2.3663 2.8388 2.7047 2.5309 1.8313 3.4565 2.2458 2.7778 2.3236 3.4017 2.8688 4.1686 1.9490 2.2185 2.1521 2.7512 2.6533 2.1089 2.2581 1.6869 2.0540 2.2603 2.6706 1.9481 2.1717 2.3660 2.0188 2.0309 1.8579 1.7294 1.6825 2.0039 1.6881 1.6508 2.0927 1.9251 2.0500 2.1027 1.8300 1.3785 1.3154 1.2955 1.2994 1.2785 1.2377 1.2951 1.2241 1.3148 1.2350 1.2054 1.3099 1.2577 1.4675 1.3687 1.3489 1.4511 1.3390 1.3812 1.4807 1.3664 1.3786 1.4463 2.8912 1.1107 1.0800 1.0891 1.0816 1.0992 1.0824 1.0879 1.0840 1.0781 8.9646 1.0621 1.0602 1.0630 1.0796 1.0627 1.0640 1.0606 1.0649 1.0612 1.0779 1.0665 1.0979 1.0937 1.0997 1.0990 1.1002 1.0995 1.1000 1.0998 1.0936 1.0941 1.0937
irintensity: 1.5166 3.8890 0.8346 1.7475 3.7064 0.0446 0.4295 1.1125 2.0863 0.1967 1.8128 5.7735 2.6400 0.4567 3.2966 7.0908 2.8625 0.4913 5.3056 1.9910 3.7774 1.4627 2.4740 1.7584 2.4043 10.6460 2.2574 8.5045 20.1775 5.1961 11.3882 10.1563 1.5878 1.5852 2.7668 4.8273 5.2128 19.2597 6.2095 1.1066 3.9845 11.0315 8.0333 2.3357 9.6327 15.1545 0.1739 2.3181 9.3136 13.3865 6.4726 1.5028 3.4195 21.7242 7.3685 6.6418 2.2594 2.7910 5.9386 1.3256 1.6100 2.2360 2.3779 16.3965 0.7502 21.4037 4.6351 0.4966 0.1192 6.1230 0.1001 2.1846 0.2009 0.8999 3.7111 3.7872 11.2866 3.1235 14.3832 3.5695 18.2927 11.5885 20.6108 5.8263 30.4189 94.9761 37.2681 21.5251 28.2423 2.5285 26.6447 21.0981 16.3498 17.8935 15.3697 12.6040 43.1528 21.0237 51.0494 65.1112 63.6025 89.9926 48.6087 22.9099 6.9511 39.9035 19.4206 57.4800
temp: 298.150 k
press: 1.00000 atm
elementType: 8 8 6 6 6 6 6 6 6 6 6 6 6 6 6 6 1 1 1 1 1 1 1 1 1 1 1 1 1 1 1 1 1 1 1 1 1 1
symmnumber: 1
zpe: 877061.0 jmol-1
zpe.correction: 0.334055 hartree
zpe.thermalcorrener: 0.348904 hartree
zpe.thermalcorrenthalpy: 0.349849 hartree
zpe.thermalcorrgfe: 0.293543 hartree
zpe.sumelectzpe: -695.821160 hartree
zpe.sumelectthermal: -695.806310 hartree
zpe.sumelectthermalent: -695.805366 hartree
zpe.sumelectthermalfe: -695.861672 hartree
dipole: -0.9166 -0.3192 2.5650
dipole: 2.7425
quadrupole: -91.2500 -112.0948 -96.1826
quadrupole: -1.6030 4.7110 -2.0026
quadrupole: 8.5925 -12.2524 3.6599 -1.6030 4.7110 -2.0026
hfenergy: -696.1552147 hartree
pointgroup: C01 [X(C14H22O2)]
dipole: -0.3665442 -0.1326155 1.0060962 debye
polarizability: 172.2430628|-1.7363855|140.7494586|3.1221097|3.49372|125.9359356 unknown
InChI: InChI=1S/C14H22O2/c15-12-8-5-9-13-14(16-13)11-7-4-2-1-3-6-10(11)12/h10-11,13-14H,1-9H2
charge 0 multiplicity 1
38 atoms
O  1.715049 2.34159 -0.915278
O  1.237875 -2.337587 -0.82119
C  0.962991 1.029786 -0.980459
C  -0.083897 0.767164 0.098937
C  2.444397 1.01811 -0.737163
C  -0.431894 -0.774126 0.100621
C  -1.295185 1.704573 -0.133831
C  3.091043 0.769653 0.616454
C  -1.387085 -1.228507 -1.03535
C  3.18811 -0.736708 0.970827
C  0.896618 -1.562183 0.113721
C  -2.400314 1.725407 0.949052
C  1.819812 -1.38745 1.328489
C  -2.844068 -1.504138 -0.583984
C  -3.241851 0.432716 1.158808
C  -3.707044 -0.291131 -0.139189
H  0.634636 0.782524 -2.00205
H  0.355009 1.026833 1.082672
H  3.073832 0.761576 -1.602071
H  -0.907963 -0.98712 1.079404
H  -1.748969 1.480895 -1.119218
H  -0.883099 2.730059 -0.21958
H  2.529733 1.310013 1.40123
H  4.107107 1.208806 0.599507
H  -0.970424 -2.154229 -1.475703
H  -1.393976 -0.488119 -1.858521
H  3.866928 -0.85666 1.836379
H  3.634982 -1.302376 0.130527
H  -3.099038 2.541503 0.673005
H  -1.955026 2.023607 1.9212
H  1.322525 -0.808371 2.128522
H  2.01595 -2.405016 1.719855
H  -2.824658 -2.243093 0.245193
H  -3.368445 -2.003713 -1.424226
H  -4.133663 0.722771 1.749459
H  -2.694848 -0.287851 1.797575
H  -4.738115 -0.666969 0.015297
H  -3.776229 0.439961 -0.970622
