program: Gaussian 09
title: 000276366
version: EM64L-G09RevD.01
frameworkgroup: C1[X(C12H14O2)]
method: RPBEPBE
basis: SDD
operation: Freq
keyword: #pfreq=noraman
keyword: PBEPBE/SDD
title: #p freq=noraman PBEPBE/SDD
converged: NO NO NO NO
title: Mulliken charges:
elementType: O O C C C C C C C C C C C C H H H H H H H H H H H H H H
charge: -0.138174 -0.186383 -0.122785 -0.251365 -0.365091 -0.374980 -0.426617 0.124421 -0.231196 -0.222652 0.158751 -0.374809 -0.483650 -0.409075 0.235825 0.266307 0.279770 0.308823 0.233279 0.203444 0.253021 0.255135 0.199626 0.187212 0.232386 0.203159 0.228250 0.217369
chargesum: 0.00000
title: Mulliken charges with hydrogens summed into heavy atoms:
elementType: O O C C C C C C C C C C C C
charge: -0.138174 -0.186383 0.113040 0.014942 -0.085321 -0.066157 0.010106 0.124421 0.021825 0.032483 0.158751 0.012029 -0.048105 0.036544
polarizability: 1.32871578e+02 7.61850302e-02 1.18745616e+02 -4.46586663e+00 1.73719177e+00 1.09415938e+02
1716.lowfreq: -14.7799 -5.1015 -0.0008 -0.0005 0.0006 6.7940 51.4778 84.4537 107.6349
frequency: 51.3321 84.4151 107.6291 162.3023 209.2810 223.3109 272.0385 304.8788 327.3793 359.5234 389.4907 402.4611 456.5740 524.0804 566.0859 601.9348 616.5955 676.7426 705.9249 731.5373 759.6534 796.1354 817.4763 824.4999 831.4831 854.5490 911.3234 920.8329 934.8023 947.1295 969.7644 977.0732 988.3045 1001.2307 1036.4781 1049.0831 1070.8002 1095.8956 1103.1065 1105.9637 1140.9718 1158.9368 1168.9985 1190.0058 1209.0269 1228.5893 1231.4819 1241.2596 1249.1263 1267.3387 1297.4659 1309.1449 1311.8546 1324.5228 1344.8500 1348.9878 1350.5368 1452.8558 1461.7223 1466.0768 1469.7226 1551.4006 1614.3487 1718.6492 2964.2707 2968.7883 2985.1420 2988.1946 2995.1589 3013.1726 3027.1128 3031.9867 3047.9731 3069.3627 3102.1492 3136.4576 3168.4232 3197.7568
redmass: 5.7014 4.7590 6.3808 3.2062 3.0972 3.3465 2.5676 3.3440 4.7654 2.7911 3.1073 4.1795 1.8347 3.7646 3.0381 3.7233 3.8792 3.0297 1.9989 4.3070 4.5053 3.3083 3.0318 2.9437 2.1651 1.8494 2.5874 1.4033 2.1609 2.6243 2.3068 2.1818 2.6628 2.2093 2.6821 1.5962 2.5237 1.3705 1.7603 1.7978 1.5854 1.4461 1.5283 1.2565 1.4898 1.4331 1.3237 1.4494 1.3364 1.2137 1.4814 1.4155 1.6244 1.4590 1.4245 1.4560 1.3983 1.1084 1.0818 1.0907 1.0858 5.5848 9.2011 11.7615 1.0626 1.0619 1.0614 1.0691 1.0757 1.0905 1.0962 1.0977 1.1017 1.1026 1.0902 1.0907 1.0885 1.1083
irintensity: 0.6248 1.2720 2.7915 0.1228 4.2439 0.4828 1.5704 1.2538 1.7470 3.8042 0.8820 1.3978 0.1033 3.6812 4.0146 10.8909 4.6887 11.1822 51.1692 13.1132 18.4690 1.9391 1.7869 0.4250 6.5918 0.7252 1.7141 0.1317 3.2469 4.8676 5.4958 0.3249 3.1205 11.3719 17.9684 6.9590 8.3700 1.5525 31.3363 2.6290 8.1007 23.8484 6.2575 5.0374 29.0726 2.9776 1.9912 2.3643 0.9459 1.8292 13.5551 6.4741 18.4147 7.7962 0.7811 5.9541 0.0965 11.1273 7.7887 11.1548 17.4080 3.9079 99.8916 261.9541 31.0182 15.9893 31.4909 5.3621 17.0222 20.2056 54.5973 36.6465 46.9249 26.9350 17.8828 2.5763 3.1127 14.6039
temp: 298.150 k
press: 1.00000 atm
elementType: 8 8 6 6 6 6 6 6 6 6 6 6 6 6 1 1 1 1 1 1 1 1 1 1 1 1 1 1
symmnumber: 1
zpe: 607541.0 jmol-1
zpe.correction: 0.231400 hartree
zpe.thermalcorrener: 0.242998 hartree
zpe.thermalcorrenthalpy: 0.243942 hartree
zpe.thermalcorrgfe: 0.193919 hartree
zpe.sumelectzpe: -615.038428 hartree
zpe.sumelectthermal: -615.026830 hartree
zpe.sumelectthermalent: -615.025886 hartree
zpe.sumelectthermalfe: -615.075909 hartree
dipole: -1.5507 -3.0491 -4.6090
dipole: 5.7397
quadrupole: -78.7816 -84.0744 -88.5251
quadrupole: 1.3316 -5.7253 -5.7463
quadrupole: 5.0121 -0.2807 -4.7314 1.3316 -5.7253 -5.7463
hfenergy: -615.2698279 hartree
pointgroup: C01 [X(C12H14O2)]
dipole: -0.5797549 -1.3090049 -1.7463719 debye
polarizability: 132.9392318|-0.00119|118.9107424|-4.3020617|1.1355237|109.1831577 unknown
InChI: InChI=1S/C12H14O2/c13-10-4-2-1-3-7-8-5-6-9(11(7)10)12(8)14/h5-9,11H,1-4H2
charge 0 multiplicity 1
28 atoms
O  1.872221 0.384034 2.140155
O  -1.09432 2.149559 0.591633
C  0.073828 -1.076473 -0.396833
C  0.02412 0.473309 -0.797918
C  1.542326 -1.222316 0.173734
C  1.395886 1.05504 -0.290565
C  -0.967697 -1.552865 0.652326
C  1.638944 0.13428 0.9495
C  2.562055 -0.889443 -0.907113
C  2.485859 0.456718 -1.172345
C  -1.19753 1.218342 -0.253167
C  -2.432465 -1.638646 0.147788
C  -2.560648 0.787484 -0.790056
C  -3.199802 -0.296881 0.126471
H  -0.03173 -1.697434 -1.305387
H  -0.020527 0.544461 -1.901941
H  1.709964 -2.139464 0.75529
H  1.397608 2.136557 -0.11193
H  -0.921477 -0.910924 1.555864
H  -0.65407 -2.564436 0.978371
H  3.245264 -1.613116 -1.356824
H  3.092337 1.027048 -1.87922
H  -2.989058 -2.337458 0.802543
H  -2.442478 -2.088366 -0.867302
H  -3.216546 1.676272 -0.812196
H  -2.46557 0.385637 -1.817288
H  -3.271747 0.108496 1.154354
H  -4.235045 -0.474613 -0.223244
