program: Gaussian 09
title: 000276365
version: EM64L-G09RevD.01
frameworkgroup: C1[X(C12H14O)]
method: RPBEPBE
basis: SDD
operation: Freq
keyword: #pfreq=noraman
keyword: PBEPBE/SDD
title: #p freq=noraman PBEPBE/SDD
converged: YES YES NO NO
title: Mulliken charges:
elementType: O C C C C C C C C C C C C H H H H H H H H H H H H H H
charge: -0.188381 -0.371227 -0.396881 -0.398436 -0.571141 -0.502692 0.367962 0.206303 0.027676 -0.417845 -0.387164 -0.233062 -0.240433 0.206716 0.197183 0.205042 0.211407 0.221195 0.214137 0.234016 0.208870 0.223621 0.245554 0.238010 0.241091 0.227504 0.230977
chargesum: 0.00000
title: Mulliken charges with hydrogens summed into heavy atoms:
elementType: O C C C C C C C C C C C C
charge: -0.188381 0.032672 0.019568 0.036896 -0.128255 -0.033518 0.367962 0.206303 0.027676 -0.179835 -0.146074 -0.005558 -0.009456
polarizability: 1.45627541e+02 1.71136934e+00 1.27675972e+02 -1.14300135e+01 5.00617486e+00 9.35675766e+01
1716.lowfreq: -18.2241 -12.8278 0.0004 0.0008 0.0010 0.2601 31.1607 81.7517 93.6696
frequency: 30.8311 81.7164 93.6492 159.8352 188.8620 256.6695 279.3161 308.9418 340.5488 371.3196 415.0905 431.3048 469.9838 537.7217 564.2519 576.7002 661.0702 679.9611 749.9035 756.6139 760.7855 782.6655 825.7502 856.4605 875.5159 897.1198 940.6184 952.1068 978.1148 987.6565 990.5374 1038.0843 1047.7155 1073.5831 1094.7077 1114.0152 1139.4730 1174.8550 1187.3479 1196.0450 1203.8987 1240.2461 1257.6106 1275.1540 1287.9434 1314.2911 1325.2098 1341.6092 1345.5204 1357.9493 1372.1146 1430.6452 1436.6376 1456.8262 1467.9092 1471.4964 1475.1383 1483.3727 1580.6378 1603.2993 1609.7810 2964.2828 2967.4888 2972.7028 2988.5204 2990.8793 3021.6993 3031.1321 3039.7088 3047.5246 3062.3603 3116.8145 3123.7338 3140.1757 3161.4487
redmass: 5.4388 3.7604 3.3648 3.5879 2.4819 2.6730 3.8957 2.8080 2.8480 3.2657 2.5354 1.8605 3.1112 3.3276 3.7137 3.8028 2.9060 4.5370 2.5216 3.0687 1.5699 2.4779 1.7118 1.9988 1.4485 2.0730 1.7618 1.5838 2.6130 1.3315 2.8179 2.1974 2.6085 2.0410 2.0344 2.0413 1.3692 1.0590 1.1931 1.3080 2.2144 1.4287 1.3513 1.8374 1.3852 1.3070 1.3466 1.3625 1.4921 1.3540 5.5583 2.1451 1.1214 1.1115 1.1080 1.0987 2.1417 1.1341 6.6021 7.4766 8.1766 1.0599 1.0618 1.0628 1.0638 1.0625 1.0975 1.1011 1.1009 1.1016 1.0982 1.0867 1.0887 1.0935 1.1006
irintensity: 2.7528 1.0877 1.0260 1.4358 0.6540 0.6302 1.6107 0.4440 1.4850 1.7324 1.9199 0.7720 1.8187 8.6929 5.8939 4.8420 1.9651 4.6101 28.6324 9.2276 51.9618 5.8115 1.9345 1.0568 3.3144 12.7151 5.0612 5.4755 13.8200 0.0668 5.5844 2.8928 4.1531 1.0998 3.4314 3.5513 5.7026 0.3345 1.2836 8.0014 7.7052 10.0979 8.3844 52.7548 1.7174 1.8254 1.1682 7.7684 1.2271 2.0634 0.3659 9.5723 15.2055 5.9898 12.6512 7.8591 11.4186 15.4008 1.6575 44.4942 86.5874 27.9564 3.8578 39.8958 23.6729 23.3496 49.7085 55.4680 27.7780 24.3370 47.8021 8.3193 1.4268 24.7765 29.4367
temp: 298.150 k
press: 1.00000 atm
elementType: 8 6 6 6 6 6 6 6 6 6 6 6 6 1 1 1 1 1 1 1 1 1 1 1 1 1 1
symmnumber: 1
zpe: 597135.2 jmol-1
zpe.correction: 0.227437 hartree
zpe.thermalcorrener: 0.238740 hartree
zpe.thermalcorrenthalpy: 0.239684 hartree
zpe.thermalcorrgfe: 0.189791 hartree
zpe.sumelectzpe: -539.938011 hartree
zpe.sumelectthermal: -539.926708 hartree
zpe.sumelectthermalent: -539.925764 hartree
zpe.sumelectthermalfe: -539.975657 hartree
dipole: 0.0977 1.5719 -3.0109
dipole: 3.3979
quadrupole: -71.3055 -73.7708 -84.4179
quadrupole: -1.5078 0.8516 7.5155
quadrupole: 5.1926 2.7272 -7.9198 -1.5078 0.8516 7.5155
hfenergy: -540.1654475 hartree
pointgroup: C01 [X(C12H14O1)]
dipole: 0.0159076 -0.7258431 1.1225257 debye
polarizability: 145.2390708|-3.0421322|126.5076835|12.026247|7.9279985|95.1243359 unknown
InChI: InChI=1S/C12H14O/c13-12-9-3-1-2-6-10-7-4-5-8-11(10)12/h4-5,7-8H,1-3,6,9H2
charge 0 multiplicity 1
27 atoms
O  -1.011017 1.84907 -1.585158
C  -2.660708 -0.945783 0.413251
C  -1.664654 -2.004129 -0.136914
C  -2.073853 0.121644 1.383471
C  -0.57598 -1.510396 -1.141207
C  -1.738075 1.488374 0.717809
C  0.599372 -0.774003 -0.507738
C  0.518357 0.606074 -0.166579
C  -0.76033 1.368665 -0.446064
C  1.806191 -1.461826 -0.22348
C  1.610747 1.263337 0.446974
C  2.902867 -0.807505 0.38158
C  2.807215 0.561924 0.716879
H  -3.163901 -0.439941 -0.436081
H  -3.455148 -1.502746 0.948205
H  -2.262232 -2.778848 -0.658706
H  -1.168062 -2.512507 0.71435
H  -1.170936 -0.282137 1.880225
H  -2.804931 0.329343 2.188117
H  -1.05995 -0.874924 -1.907084
H  -0.18336 -2.3983 -1.67213
H  -1.281256 2.147747 1.486081
H  -2.654869 1.981777 0.347297
H  1.885349 -2.523702 -0.487641
H  1.533165 2.327503 0.699637
H  3.826727 -1.36042 0.585038
H  3.654469 1.07981 1.179468
