program: Gaussian 09
title: 000276378
version: EM64L-G09RevD.01
frameworkgroup: C1[X(C14H26O2)]
method: RPBEPBE
basis: SDD
operation: Freq
keyword: #pfreq=noraman
keyword: PBEPBE/SDD
title: #p freq=noraman PBEPBE/SDD
converged: NO YES NO NO
title: Mulliken charges:
elementType: O O C C C C C C C C C C C C C C H H H H H H H H H H H H H H H H H H H H H H H H H H
charge: -0.505610 -0.480598 0.290447 0.302573 -0.510571 -0.494719 -0.491190 -0.503264 -0.423326 -0.476648 -0.390114 -0.422034 -0.347025 -0.449187 -0.398450 -0.410283 0.203654 0.240117 0.254688 0.205766 0.196476 0.230425 0.245856 0.188511 0.207442 0.196891 0.216256 0.217614 0.183852 0.227018 0.235537 0.190404 0.194105 0.196597 0.190068 0.216424 0.189189 0.195977 0.199218 0.192045 0.343326 0.352539
chargesum: 0.00000
title: Mulliken charges with hydrogens summed into heavy atoms:
elementType: O O C C C C C C C C C C C C C C
charge: -0.162284 -0.128059 0.290447 0.302573 -0.066799 -0.034264 -0.064288 -0.068897 -0.018994 -0.042778 0.020757 0.003907 0.043677 -0.042694 -0.013284 -0.019020
polarizability: 1.82810222e+02 2.01337724e+00 1.37154253e+02 -6.44321017e-02 5.98956621e-01 1.34973925e+02
1716.lowfreq: -13.4250 -0.0006 -0.0003 0.0003 6.1998 14.0804 66.8082 75.0562 86.3785
frequency: 66.7576 74.8081 86.0444 124.3497 147.1733 147.9519 187.3182 206.5822 238.3283 238.8995 280.7934 283.9716 305.9087 319.9628 329.2982 341.1860 368.2157 386.8156 408.3891 421.5366 439.0969 468.1624 475.9999 517.2970 534.1995 540.1874 653.7372 677.7436 735.0728 738.8343 748.8991 775.3586 801.7093 843.6061 847.3286 854.6025 867.6686 883.6769 896.1358 906.6133 933.0456 939.8201 950.8997 1003.8996 1018.6873 1025.3439 1032.9006 1039.6796 1056.8532 1061.5300 1070.0359 1083.9033 1134.7132 1141.3622 1148.9807 1156.3780 1183.1320 1189.9931 1197.9276 1198.7401 1205.5508 1232.7965 1247.7991 1248.0951 1266.2018 1271.0747 1283.3856 1290.0748 1299.9452 1322.8914 1326.0326 1330.2403 1337.6260 1338.8659 1342.6445 1345.0864 1352.0932 1357.1658 1359.9878 1364.4720 1379.7042 1391.0476 1446.1900 1453.7155 1463.3012 1463.7655 1465.9128 1467.9628 1470.5191 1478.2781 1479.3918 1484.7525 1486.5630 1491.6185 2928.2437 2954.4585 2958.0124 2966.1710 2969.4335 2972.5071 2977.5207 2978.4262 2980.5493 2983.3304 2989.6134 2991.5086 3003.7523 3006.8551 3018.5855 3023.7071 3026.2271 3031.9272 3041.5020 3045.1604 3048.7642 3050.7175 3054.7684 3055.9616 3472.6101 3586.6430
redmass: 3.1865 3.0723 2.6983 1.9598 3.5475 2.2139 2.3833 3.6972 3.1556 2.2901 2.5102 2.4662 1.2174 2.0820 3.1602 3.2775 2.4857 2.7001 1.9895 3.0844 1.9881 2.6924 3.1205 1.9636 1.3650 1.7349 2.4422 2.6040 2.5211 1.3654 1.5118 2.7417 2.5016 1.7103 2.0970 2.2313 2.6584 2.0090 2.3631 2.1458 2.0505 2.2366 2.0695 2.5192 1.6941 2.1894 1.7498 2.2259 1.7182 1.7317 2.0112 2.0005 2.2653 2.4549 2.1917 1.9167 1.8397 1.4689 1.1907 1.3732 1.1756 1.3955 1.1464 1.3139 1.4387 1.1945 1.2520 1.1581 1.1953 1.3701 1.4269 1.4389 1.4281 1.3476 1.4054 1.3284 1.4541 1.3895 1.4035 1.3899 1.3692 1.5891 1.0912 1.0853 1.0800 1.0869 1.0832 1.0857 1.0816 1.0695 1.0854 1.0785 1.0811 1.0881 1.0696 1.0599 1.0625 1.0633 1.0630 1.0638 1.0615 1.0629 1.0660 1.0634 1.0646 1.0634 1.0956 1.0915 1.0947 1.1005 1.1011 1.0976 1.0975 1.0989 1.0988 1.0989 1.0986 1.0988 1.0641 1.0658
irintensity: 0.3667 0.3870 0.6505 0.7579 0.7591 1.1836 4.2614 0.2506 5.6383 4.7511 6.2558 8.5343 77.9539 3.1073 0.3069 7.5770 1.0215 2.8499 1.3526 5.9876 0.7651 1.5183 9.7301 1.2877 133.7577 49.2246 8.9504 0.6817 17.8303 1.4896 4.8744 8.8116 7.9830 2.1705 8.9453 16.7860 20.1154 1.3810 23.4748 2.1237 19.7172 4.3920 6.0774 15.1872 3.8253 1.7766 14.6244 20.2175 4.0727 7.2016 4.0216 2.0446 14.9365 4.4473 7.5685 8.9583 6.6506 22.7428 11.6414 3.7958 3.1893 3.8400 16.5887 12.0186 12.3937 1.7702 0.3299 4.8766 3.9962 7.9103 1.3224 5.8924 2.4264 4.8767 2.5543 0.8284 8.8261 4.5672 0.6507 3.6829 12.9266 50.4640 4.0437 4.3993 9.3143 7.2256 5.1474 3.5973 4.5720 9.3350 7.9920 14.9551 24.2926 13.5510 30.3617 19.1894 32.8810 48.5439 19.0347 22.8211 26.8510 21.6425 32.3105 62.5660 44.3463 7.0977 38.9053 52.0300 46.3365 82.3397 59.2984 64.9103 45.8989 17.9622 6.7085 30.0687 67.4379 49.0905 22.2379 5.6474
temp: 298.150 k
press: 1.00000 atm
elementType: 8 8 6 6 6 6 6 6 6 6 6 6 6 6 6 6 1 1 1 1 1 1 1 1 1 1 1 1 1 1 1 1 1 1 1 1 1 1 1 1 1 1
symmnumber: 1
zpe: 995291.6 jmol-1
zpe.correction: 0.379087 hartree
zpe.thermalcorrener: 0.395472 hartree
zpe.thermalcorrenthalpy: 0.396416 hartree
zpe.thermalcorrgfe: 0.337290 hartree
zpe.sumelectzpe: -698.209071 hartree
zpe.sumelectthermal: -698.192686 hartree
zpe.sumelectthermalent: -698.191742 hartree
zpe.sumelectthermalfe: -698.250868 hartree
dipole: -2.7074 1.1549 -1.0321
dipole: 3.1191
quadrupole: -95.5093 -102.7471 -99.7092
quadrupole: 2.2466 -1.8395 0.0630
quadrupole: 3.8126 -3.4252 -0.3873 2.2466 -1.8395 0.0630
hfenergy: -698.588158 hartree
pointgroup: C01 [X(C14H26O2)]
dipole: -1.0646733 -0.5805994 0.1877908 debye
polarizability: 182.8431334|-1.6094071|136.4058216|0.0729054|1.1584185|135.6894445 unknown
InChI: InChI=1S/C14H26O2/c15-13(9-5-1-2-6-10-13)14(16)11-7-3-4-8-12-14/h15-16H,1-12H2
charge 0 multiplicity 1
42 atoms
O  -1.060562 0.573582 -1.582852
O  0.960137 1.800273 -0.350987
C  -0.770193 0.064019 -0.203375
C  0.79268 0.350946 -0.079161
C  -1.108042 -1.447147 -0.112771
C  -1.564419 0.897991 0.845691
C  1.297421 0.142809 1.366686
C  1.595488 -0.460458 -1.147559
C  -2.561077 -1.863014 -0.453448
C  -2.998227 1.351053 0.461935
C  2.814705 0.354073 1.602245
C  3.042492 0.048951 -1.368503
C  -3.699513 -1.187914 0.352842
C  -3.984389 0.270985 -0.081393
C  3.710336 -0.774313 1.02828
C  4.121657 -0.594958 -0.459209
H  -0.873787 -1.786423 0.915966
H  -0.441325 -2.005426 -0.794653
H  -0.986081 1.816186 1.060159
H  -1.6074 0.314916 1.785215
H  1.034278 -0.882691 1.69675
H  0.746631 0.846007 2.017457
H  1.033471 -0.393051 -2.097718
H  1.620961 -1.530939 -0.864666
H  -2.623768 -2.960201 -0.308869
H  -2.748905 -1.692736 -1.534732
H  -2.936304 2.186009 -0.263899
H  -3.434406 1.794267 1.378338
H  2.969311 0.406258 2.698615
H  3.116495 1.33808 1.196417
H  3.036572 1.145714 -1.229449
H  3.330504 -0.12976 -2.423597
H  -3.478187 -1.230356 1.438542
H  -4.623337 -1.781284 0.201846
H  -4.012526 0.287927 -1.193874
H  -5.009034 0.553055 0.230328
H  3.174551 -1.738067 1.154651
H  4.632856 -0.862552 1.636285
H  5.03245 0.035297 -0.511999
H  4.408625 -1.586292 -0.866302
H  -2.040241 0.615358 -1.70933
H  0.424207 1.969327 -1.174202
