program: Gaussian 09
title: 000276346
version: EM64L-G09RevD.01
frameworkgroup: C1[X(C9H11N)]
method: RPBEPBE
basis: SDD
operation: Freq
keyword: #pfreq=noraman
keyword: PBEPBE/SDD
title: #p freq=noraman PBEPBE/SDD
converged: NO YES NO NO
title: Mulliken charges:
elementType: N C C C C C C C C C H H H H H H H H H H H
charge: -0.550307 0.291808 -0.336208 -0.335998 -0.326074 -0.242029 -0.244490 -0.244471 -0.257876 -0.553044 0.263872 0.263935 0.269783 0.258897 0.259500 0.259507 0.260538 0.211127 0.211015 0.270302 0.270213
chargesum: 0.00000
title: Mulliken charges with hydrogens summed into heavy atoms:
elementType: N C C C C C C C C C
charge: -0.009793 0.291808 -0.072336 -0.072063 -0.056291 0.016868 0.015010 0.015037 0.002662 -0.130901
polarizability: 9.55132483e+01 -1.16312671e+00 8.29567933e+01 8.79939748e-04 -2.97262176e-03 8.17628347e+01
1716.lowfreq: -32.0477 -8.9894 -0.0009 -0.0007 -0.0004 22.2201 90.1453 129.6343 209.7212
frequency: 89.8372 129.6330 209.7168 279.7450 349.3289 527.5259 605.0757 613.3788 667.5590 682.5298 683.9889 768.5820 786.8211 809.2906 818.4626 823.3253 830.2103 842.6165 846.3389 890.2573 896.2704 916.0568 970.9110 995.7318 1012.3519 1034.5500 1053.2201 1056.3584 1075.6331 1090.1376 1091.4660 1123.5755 1131.5252 1142.0937 1145.9832 1159.6465 1167.5861 1192.7636 1202.1744 1208.5461 1217.2514 1311.2592 1327.6126 1328.4335 1446.6492 1638.4177 2969.6064 3024.9084 3064.1765 3069.3444 3075.6585 3085.6709 3092.2343 3092.3364 3117.4743 3431.7788 3558.2324
redmass: 2.7951 3.7143 1.4209 1.3683 3.6066 2.4105 2.5596 2.0317 2.2651 4.5591 4.5599 2.9951 1.5943 1.8891 1.8345 1.6781 1.4578 1.7518 1.8301 1.5854 1.4369 2.4330 1.7172 5.1025 5.9243 2.5839 2.5871 2.2091 3.5043 1.9454 2.0913 2.3783 1.2557 1.3530 1.3955 1.5475 1.8428 1.9473 1.8583 1.7510 1.8085 2.9679 1.1955 1.4872 1.0785 1.0870 1.0597 1.1029 1.0907 1.0906 1.0898 1.0925 1.0956 1.0950 1.1059 1.0443 1.0969
irintensity: 0.0254 1.4430 25.8907 36.4382 4.6715 67.8052 0.2150 107.0202 188.4491 0.2207 1.5454 3.6821 0.9708 0.8215 0.3029 0.0417 0.3784 11.1970 14.8679 5.7860 3.3120 15.4270 0.6277 5.4719 0.4073 0.0402 0.9885 0.4023 3.4744 1.5384 0.1267 9.2981 0.0060 0.4030 0.0499 0.4309 0.0462 5.1105 6.9418 10.8657 5.6380 5.7075 0.0819 3.4017 5.7822 27.9770 49.8957 28.4883 18.2798 24.0755 9.8557 45.0816 102.6839 93.7264 25.0778 2.5208 0.0352
temp: 298.150 k
press: 1.00000 atm
elementType: 7 6 6 6 6 6 6 6 6 6 1 1 1 1 1 1 1 1 1 1 1
symmnumber: 1
zpe: 459197.6 jmol-1
zpe.correction: 0.174899 hartree
zpe.thermalcorrener: 0.182671 hartree
zpe.thermalcorrenthalpy: 0.183615 hartree
zpe.thermalcorrgfe: 0.142560 hartree
zpe.sumelectzpe: -403.379664 hartree
zpe.sumelectthermal: -403.371893 hartree
zpe.sumelectthermalent: -403.370949 hartree
zpe.sumelectthermalfe: -403.412003 hartree
dipole: -1.1613 -0.6193 -0.0007
dipole: 1.3161
quadrupole: -67.7307 -56.8706 -56.9226
quadrupole: -2.3727 -0.0040 -0.0005
quadrupole: -7.2227 3.6374 3.5854 -2.3727 -0.0040 -0.0005
hfenergy: -403.5545633 hartree
pointgroup: C01 [X(C9H11N1)]
dipole: -0.4618904 0.2340375 -0.0017942 debye
dipolederiv: -1.1224336 -0.0725387 0.0018605 -0.0243431 -0.3834724 0.0021347 0.0009801 0.0022587 -0.1707849 0.0602853 -0.0521483 0.0006582 -0.0240008 0.0208143 0.0000745 0.0008658 0.0004297 0.0629143 -0.0424374 0.0281535 0.042048 0.0761306 -0.0481543 0.0462949 0.0847616 0.0334093 0.0395781 -0.0435057 0.0266446 -0.0422882 0.0731607 -0.0503425 -0.044016 -0.0862739 -0.030978 0.0425895 -0.1694097 -0.0260032 0.0003205 -0.0586789 0.1023814 -0.0020162 0.000982 -0.0020964 -0.0561559 -0.0222147 -0.0319262 0.0004288 -0.0131164 0.1332567 -0.0020599 0.0001211 -0.0020313 -0.019871 0.0159703 0.0311111 -0.0695922 0.0124514 -0.0018003 -0.0363373 -0.0769588 -0.0378205 0.0860731 0.016843 0.0333322 0.0689904 0.0149647 0.000394 0.0386638 0.0767259 0.040179 0.0833411 0.1267414 -0.0336935 0.0001299 -0.0436109 -0.015766 -0.000108 0.0003208 -0.0001539 -0.0250705 0.4918044 0.0493966 -0.0010553 0.1040806 0.3597502 -0.0015788 -0.0014442 -0.0018886 0.1777523 0.015451 -0.052405 -0.1168058 -0.0447813 0.0308551 -0.0896744 -0.1058463 -0.0860446 -0.106332 0.0165909 -0.0486432 0.1174552 -0.0412348 0.0356965 0.0859178 0.106227 0.0823218 -0.1122177 0.0706508 0.0437968 -0.0006169 0.026687 -0.1995663 0.0037374 -0.0003265 0.0037161 0.0763716 0.0655658 0.0237605 -0.0003099 0.0419064 -0.2110107 0.0039507 -0.0005341 0.0039563 0.0786005 0.0120331 -0.0447344 0.1021671 -0.044592 0.0404839 0.0879659 0.1129213 0.0880556 -0.1185577 0.0109794 -0.0480253 -0.1014967 -0.048147 0.0354408 -0.0920388 -0.1122395 -0.092174 -0.1125825 -0.2076015 0.0677574 -0.000302 0.0675606 0.0644067 0.0000979 -0.0003487 0.0001011 0.0807316 -0.0140544 0.0050004 0.028359 0.0144463 -0.0277695 -0.0972508 0.0673723 -0.1485793 -0.0698314 -0.0142682 0.0043203 -0.0284217 0.0129214 -0.0224523 0.0961235 -0.0677759 0.1474837 -0.0751344 0.3667691 0.0496997 0.1328638 -0.0501953 0.0667787 -0.0890558 0.0769797 -0.0761432 0.0706879 0.3662408 0.0471446 -0.1343927 -0.0516093 0.070076 0.0891746 -0.0765099 0.0759984 0.0678982 unknown
polarizability: 95.4590744|1.4245621|83.0107235|-0.0281225|-0.0175226|81.7630785 unknown
InChI: InChI=1S/C9H11N/c10-1-9-6-3-2-4(6)8(9)5(2)7(3)9/h2-8H,1,10H2
charge 0 multiplicity 1
21 atoms
N  3.06944 0.504888 -0.00756
C  0.670901 -0.309129 0.002294
C  -0.074523 0.561908 1.11873
C  -0.07977 0.530351 -1.134904
C  -0.541149 -1.353018 0.019696
C  -0.815001 1.393222 -0.018141
C  -1.273206 -0.48687 1.135666
C  -1.278531 -0.51838 -1.116404
C  -2.015457 0.346486 -0.00055
C  2.149578 -0.659714 0.005136
H  0.402711 0.992772 2.010624
H  0.393229 0.935965 -2.040788
H  -0.426807 -2.445784 0.034567
H  -0.925164 2.485761 -0.033117
H  -1.749001 -0.889216 2.039688
H  -1.758499 -0.945783 -2.006624
H  -3.082709 0.6053 -0.001775
H  2.384329 -1.290173 -0.87579
H  2.384906 -1.271013 0.899347
H  2.992513 1.089536 0.833105
H  2.990707 1.072693 -0.859498
