program: Gaussian 09
title: 000282859
version: EM64L-G09RevD.01
frameworkgroup: C1[X(C13H12BrN)]
method: RPBEPBE
basis: SDD
operation: Freq
keyword: #p
keyword: freq=noraman
keyword: PBEPBE/SDD
title: #p freq=noraman PBEPBE/SDD
converged: NO YES NO NO
title: Mulliken charges:
elementType: Br N C C C C C C C C C C C C C H H H H H H H H H H H H
charge: -0.005896 -0.697354 -0.744970 0.508145 0.513602 -0.370797 -0.369734 -0.374427 -0.374659 -0.417400 -0.417483 0.489184 -0.187666 -0.187557 -0.210885 0.215216 0.215357 0.215376 0.215283 0.229941 0.230011 0.213224 0.213219 0.246721 0.246717 0.303414 0.303420
chargesum: 0.00000
title: Mulliken charges with hydrogens summed into heavy atoms:
elementType: Br N C C C C C C C C C C C C C
charge: -0.005896 -0.090520 -0.314396 0.508145 0.513602 -0.155421 -0.154451 -0.144486 -0.144649 -0.204176 -0.204265 0.489184 0.059056 0.059160 -0.210885
polarizability: 2.24836814e+02 -5.57274691e+00 1.14435050e+02 -1.33939242e-01 -3.15143123e-01 1.46757411e+02
1716.lowfreq: -24.4476 -3.7945 -0.0007 -0.0004 -0.0004 2.0880 9.9852 28.3949 32.9934
frequency: -24.3807 28.3912 32.8193 89.7076 142.5451 174.6349 261.1896 265.0229 282.7337 332.4708 353.7522 360.2021 360.6711 392.5323 403.7394 409.6309 457.6368 502.8019 537.2759 611.9481 625.3215 639.9666 705.9385 716.4586 764.1439 793.7216 813.4649 817.2764 827.8145 830.0794 858.5219 917.4120 934.2925 949.6916 952.4490 966.0496 994.3458 1000.1548 1016.8210 1060.3259 1098.0832 1127.6785 1157.7270 1184.2805 1189.0182 1195.5694 1213.0388 1291.2228 1295.9271 1314.5022 1318.4493 1371.7695 1384.2899 1392.8117 1435.1678 1466.9622 1474.8255 1518.5201 1581.9672 1583.8941 1593.8880 1632.7555 1644.7927 2990.5013 3046.2846 3106.8764 3108.7494 3126.8138 3129.4190 3130.0898 3136.7406 3165.9844 3169.2648 3571.2625 3711.5600
redmass: 3.5812 7.8663 3.8807 6.4531 5.9806 6.3107 8.4717 3.5585 5.3916 1.2606 2.3163 6.3200 1.0448 2.2636 2.8157 2.7216 4.3632 2.6342 3.6954 3.9543 6.9255 6.4419 3.7889 3.6824 2.6469 3.9580 1.2624 1.7068 1.2501 4.8987 2.1390 1.7863 1.3826 1.3638 1.4001 1.3765 5.1728 2.8864 1.4339 2.5824 1.3898 1.2344 1.0783 1.1435 1.1098 2.9134 2.4954 1.4565 1.2696 3.0890 1.2884 7.3424 4.9416 2.7965 3.2719 1.6297 1.3954 3.0365 7.3299 6.5812 6.2676 1.9656 1.9687 1.0595 1.1025 1.0867 1.0866 1.0904 1.0895 1.0953 1.0970 1.0949 1.0960 1.0448 1.1040
irintensity: 0.0075 0.3905 0.0036 1.3648 2.4444 0.4130 6.1714 1.1969 4.9681 286.1356 0.8302 36.0422 0.0859 1.0465 0.0005 0.0698 6.3639 17.3782 31.7146 11.7278 0.2349 0.4360 1.4369 8.3480 30.6216 38.6933 0.0493 53.8043 0.2453 5.0736 36.7524 0.0091 0.3792 0.2639 0.2495 0.4399 58.6566 0.1320 0.1842 26.0795 1.8410 25.5999 2.1166 6.5045 17.1469 0.5521 3.6026 0.5697 0.2579 70.5987 1.3729 0.8229 14.2810 0.7224 0.1780 67.3288 43.5224 133.0239 1.6615 1.3110 5.4754 0.0100 294.1956 42.2906 11.3138 0.2235 44.5767 0.2155 13.1878 57.9325 3.8559 12.0489 0.4317 72.8727 19.8143
temp: 298.150 k
press: 1.00000 atm
elementType: 35 7 6 6 6 6 6 6 6 6 6 6 6 6 6 1 1 1 1 1 1 1 1 1 1 1 1
symmnumber: 1
zpe: 556530.6 jmol-1
zpe.correction: 0.211971 hartree
zpe.thermalcorrener: 0.224772 hartree
zpe.thermalcorrenthalpy: 0.225716 hartree
zpe.thermalcorrgfe: 0.170676 hartree
zpe.sumelectzpe: -569.745463 hartree
zpe.sumelectthermal: -569.732662 hartree
zpe.sumelectthermalent: -569.731718 hartree
zpe.sumelectthermalfe: -569.786758 hartree
dipole: 4.1184 -0.5135 -0.0027
dipole: 4.1503
quadrupole: -88.9799 -95.5959 -84.5495
quadrupole: -12.9527 -0.1119 -0.1048
quadrupole: 0.7286 -5.8875 5.1589 -12.9527 -0.1119 -0.1048
hfenergy: -569.957434 hartree
pointgroup: C01 [X(C13H12Br1N1)]
dipole: -1.6328035 0.000604 -0.0104166 debye
polarizability: 224.4066332|-0.0682595|146.7572552|8.8526846|-0.3326953|114.8653869 unknown
InChI: InChI=1S/C13H12BrN/c14-12-5-1-10(2-6-12)9-11-3-7-13(15)8-4-11/h1-8H,9,15H2
charge 0 multiplicity 1
27 atoms
Br 5.220661 0.008244 1.727413
N  -4.794034 0.010933 1.556329
C  -0.048289 -0.010957 -1.78253
C  -1.316089 -0.005484 -0.925366
C  1.238963 -0.006409 -0.95511
C  -1.919441 1.209243 -0.512323
C  -1.913756 -1.214616 -0.48824
C  1.844163 -1.220168 -0.542117
C  1.844983 1.211808 -0.556738
C  -3.065793 1.225677 0.305844
C  -3.060017 -1.220165 0.330129
C  -3.65582 0.005623 0.74646
C  3.015495 -1.228767 0.249045
C  3.016322 1.229096 0.234303
C  3.586121 0.002296 0.628892
H  -0.053539 0.873456 -2.447158
H  -0.053818 -0.903123 -2.436753
H  -1.487647 2.164294 -0.838475
H  -1.477591 -2.173962 -0.795382
H  1.399827 -2.17713 -0.84076
H  1.401085 2.165399 -0.866626
H  -3.512016 2.182576 0.604584
H  -3.501723 -2.173023 0.647904
H  3.472744 -2.17317 0.558003
H  3.474162 2.176827 0.531996
H  -5.214123 0.884466 1.857982
H  -5.210129 -0.858463 1.874995
