program: Gaussian 09
title: 000282836
version: EM64L-G09RevD.01
frameworkgroup: C1[X(C13H17NO2)]
method: RPBEPBE
basis: SDD
operation: Freq
keyword: #p
keyword: freq=noraman
keyword: PBEPBE/SDD
title: #p freq=noraman PBEPBE/SDD
converged: YES YES NO NO
title: Mulliken charges:
elementType: O O N C C C C C C C C C C C C C H H H H H H H H H H H H H H H H H
charge: -0.302119 -0.292147 -0.492820 0.338621 0.011642 0.435542 -0.774802 -0.842644 0.174472 -0.443462 -0.334931 -0.196928 -0.220466 -0.213721 -0.256234 -0.679005 0.329988 0.240167 0.271507 0.234591 0.226771 0.207683 0.294073 0.234515 0.253935 0.228088 0.227402 0.225615 0.224337 0.231555 0.211442 0.222713 0.224620
chargesum: 0.00000
title: Mulliken charges with hydrogens summed into heavy atoms:
elementType: O O N C C C C C C C C C C C C C
charge: -0.302119 -0.292147 -0.162833 0.338621 0.011642 0.435542 -0.028537 -0.114117 0.174472 -0.208946 -0.080996 0.031160 0.006936 0.236231 -0.024679 -0.020230
polarizability: 2.86134084e+02 -2.07504709e+01 1.54120065e+02 -7.75393172e+00 -1.18150238e+01 9.41634343e+01
1716.lowfreq: -9.2140 -4.5016 -1.3700 -0.0007 -0.0002 0.0005 27.8433 38.4509 48.6573
frequency: 27.6863 38.4143 48.6482 62.8980 90.4141 107.5332 127.6072 153.2900 183.7608 208.4608 224.2161 245.9034 255.4595 286.5393 320.9250 328.1527 374.0929 380.6066 411.4196 412.6343 488.5117 524.3005 551.0619 560.2924 614.1727 630.6242 672.6485 695.3805 710.4539 752.2388 779.7584 798.1839 815.6544 832.8323 844.8332 900.5339 923.4296 965.8893 984.5083 986.5662 998.4501 1025.2512 1029.0584 1037.9433 1042.5462 1064.4511 1084.9810 1107.3058 1114.2468 1135.0643 1171.9222 1187.0977 1217.1532 1244.0684 1291.6997 1322.1866 1345.9756 1364.7017 1379.6518 1390.3969 1397.3391 1406.6525 1423.5085 1456.8590 1461.4475 1464.1052 1468.6542 1476.1557 1483.0494 1487.8235 1494.4096 1510.2256 1571.4100 1591.5209 1605.5744 1618.0830 2939.4279 2991.5331 3003.7761 3007.7036 3014.4670 3063.4906 3088.3001 3089.9707 3101.3287 3104.5161 3120.3460 3128.6514 3132.4158 3145.0437 3163.5423 3175.4089 3520.4013
redmass: 3.3619 4.2537 3.5393 2.8019 5.1411 2.9316 3.0628 2.6548 1.1753 3.6179 1.1739 3.1503 1.4223 3.5301 3.3554 2.8477 3.2689 4.3550 3.0367 3.5970 2.4845 2.1288 3.5641 5.1079 6.2645 2.0543 4.3540 2.0663 7.3737 1.8995 3.7438 1.0998 3.8665 1.3497 3.3207 1.4483 2.4382 1.3803 4.6272 1.3606 1.6952 2.1494 2.1472 1.3886 1.5321 4.7185 1.5853 2.1856 2.3624 1.4605 1.0511 1.1147 3.7450 1.1379 2.1344 1.6185 2.0005 1.8699 4.3961 1.4960 1.2943 1.1963 1.9437 1.0882 1.3377 1.0423 1.1246 1.0665 1.6971 1.0884 1.5754 1.2250 8.5484 6.7708 4.1774 5.1108 1.0441 1.0356 1.0402 1.0581 1.0939 1.1060 1.0985 1.0943 1.1026 1.0933 1.0875 1.0991 1.0871 1.0934 1.0964 1.0985 1.0744
irintensity: 0.7583 0.2552 1.1545 0.5326 0.9226 2.8166 4.1989 4.9328 0.4374 3.9885 1.0216 2.7528 2.5160 1.7578 4.1292 3.2392 2.5488 12.9747 1.7132 3.8309 62.7257 36.9925 11.5768 4.6221 1.0695 50.7526 2.1222 38.3024 15.7063 93.2682 9.1957 2.9363 4.4259 0.6253 7.8616 8.5208 21.4667 0.0087 0.0568 0.5216 21.0884 26.1382 12.3366 4.3995 4.6384 549.5026 18.2426 2.5216 3.2600 4.6507 0.4744 7.6562 85.5769 0.0611 87.8832 34.3008 196.7787 180.6078 98.2049 92.3091 23.7942 17.7899 1.9693 12.2457 60.3259 15.0096 10.8662 2.3988 121.2940 23.6297 90.6903 7.6679 203.7965 202.0654 598.4320 38.8172 41.2486 22.9124 12.4618 27.4484 29.1068 6.8813 43.1984 9.2166 51.8415 1.6763 10.6371 6.0880 0.6699 24.5015 34.7684 6.7306 20.0452
temp: 298.150 k
press: 1.00000 atm
elementType: 8 8 7 6 6 6 6 6 6 6 6 6 6 6 6 6 1 1 1 1 1 1 1 1 1 1 1 1 1 1 1 1 1
symmnumber: 1
zpe: 715258.2 jmol-1
zpe.correction: 0.272427 hartree
zpe.thermalcorrener: 0.289190 hartree
zpe.thermalcorrenthalpy: 0.290134 hartree
zpe.thermalcorrgfe: 0.226824 hartree
zpe.sumelectzpe: -709.584369 hartree
zpe.sumelectthermal: -709.567607 hartree
zpe.sumelectthermalent: -709.566663 hartree
zpe.sumelectthermalfe: -709.629973 hartree
dipole: 2.8910 -1.7979 -0.4649
dipole: 3.4361
quadrupole: -92.2643 -91.9247 -96.9080
quadrupole: 12.6124 0.2741 -4.5079
quadrupole: 1.4347 1.7743 -3.2090 12.6124 0.2741 -4.5079
hfenergy: -709.8567967 hartree
pointgroup: C01 [X(C13H17N1O2)]
dipole: 1.1290516 -0.6050355 -0.432063 debye
polarizability: 285.4732423|-16.6522329|154.8616222|-18.3190956|9.9658733|94.0827195 unknown
InChI: InChI=1S/C13H17NO2/c1-4-16-13(15)10(2)11(3)14-12-8-6-5-7-9-12/h5-9,14H,4H2,1-3H3
charge 0 multiplicity 1
33 atoms
O  -3.195445 -0.381643 -0.267178
O  -3.815426 1.596832 0.787166
N  0.887054 0.950882 0.049597
C  -0.4078 0.429233 -0.099848
C  -1.457671 1.186494 0.427291
C  2.151653 0.323557 -0.11795
C  -0.543942 -0.851699 -0.900175
C  -1.16012 2.482145 1.174315
C  -2.888104 0.858906 0.339654
C  3.252237 1.131414 -0.519142
C  2.375197 -1.050646 0.171228
C  4.541936 0.574846 -0.638479
C  3.666199 -1.601969 0.028616
C  -4.649252 -0.705679 -0.334148
C  4.757542 -0.798626 -0.37557
C  -4.766029 -2.064614 -1.019935
H  0.931251 1.930702 0.33951
H  0.365003 -1.04675 -1.490669
H  -1.412067 -0.775423 -1.569628
H  -0.741344 -1.724023 -0.251555
H  -0.485497 2.316645 2.037824
H  -0.701424 3.255599 0.520916
H  -2.10367 2.904169 1.552432
H  3.087893 2.19134 -0.749358
H  1.554546 -1.674877 0.534605
H  5.377292 1.212651 -0.948142
H  3.821786 -2.662599 0.255888
H  -5.055247 -0.716069 0.693705
H  -5.166309 0.095325 -0.893244
H  5.758141 -1.231633 -0.47599
H  -5.829286 -2.359391 -1.089103
H  -4.349301 -2.029945 -2.041682
H  -4.227296 -2.841454 -0.449952
