program: Gaussian 09
title: 000282840
version: EM64L-G09RevD.01
frameworkgroup: C1[X(C14H15NO3)]
method: RPBEPBE
basis: SDD
operation: Freq
keyword: #p
keyword: freq=noraman
keyword: PBEPBE/SDD
title: #p freq=noraman PBEPBE/SDD
converged: YES YES NO NO
title: Mulliken charges:
elementType: O O O N C C C C C C C C C C C C C C H H H H H H H H H H H H H H H
charge: -0.267632 -0.279113 -0.267240 -0.017393 0.210489 0.239356 -0.036275 0.118890 -0.354812 -0.486461 -0.304514 -0.241601 -0.235830 0.169179 -0.220385 -0.687562 -0.256779 -0.664106 0.268776 0.275777 0.263607 0.230580 0.208298 0.275156 0.232243 0.214521 0.232537 0.226466 0.231766 0.224352 0.218744 0.228765 0.250202
chargesum: 0.00000
title: Mulliken charges with hydrogens summed into heavy atoms:
elementType: O O O N C C C C C C C C C C C C C C
charge: -0.267632 -0.279113 -0.267240 -0.017393 0.210489 0.239356 -0.036275 0.118890 -0.086035 -0.210685 -0.040907 -0.011021 0.247624 0.169179 0.011858 -0.014037 0.199339 0.033604
polarizability: 2.66798063e+02 -4.30810073e+00 1.84726815e+02 7.55410607e+00 1.17426450e+01 9.19007541e+01
1716.lowfreq: -4.0343 -0.0007 -0.0005 0.0000 4.2687 7.5531 36.2460 46.8811 55.2762
frequency: 36.2184 46.8733 55.2710 64.9660 93.7121 117.9190 119.5537 152.7388 168.4437 218.4531 220.6490 242.0425 260.1989 265.7815 304.2332 315.8581 330.8093 395.3953 426.6637 434.4315 483.6029 505.8494 527.3928 580.9590 595.3909 616.5222 658.8629 710.1985 728.7712 741.0041 781.0799 793.5110 797.6268 809.7639 815.5687 821.4780 882.0540 891.0294 918.5043 944.1774 976.9171 1000.3186 1005.5519 1014.8883 1023.6221 1071.0290 1095.1827 1108.9228 1116.4079 1136.1072 1152.9035 1161.6174 1188.4387 1208.9816 1235.6907 1257.1666 1276.2435 1278.9451 1310.5530 1351.8887 1359.4939 1375.0875 1390.8363 1395.2321 1404.6023 1419.2964 1447.8534 1456.7044 1461.7678 1463.0375 1474.9497 1478.7328 1484.3748 1489.9644 1558.5393 1562.3302 1599.9906 1619.8621 2992.1389 2993.0126 2994.9669 3030.6937 3083.0176 3088.3675 3091.5988 3093.5321 3110.3179 3119.4467 3133.3979 3150.5133 3156.9021 3169.6997 3177.8614
redmass: 4.1438 2.9969 3.9186 4.4017 3.3491 2.6457 2.9089 2.7964 3.4543 1.8034 2.5134 1.4559 6.6419 3.6341 3.9889 3.2295 4.0452 5.8949 3.4645 3.2943 4.1065 5.1852 6.6122 7.0761 3.9981 6.3239 5.5544 4.8524 4.9481 4.5419 1.3676 3.8559 4.2102 2.0781 1.2296 1.7226 4.4036 1.6570 3.8709 1.4422 1.3674 1.3261 2.4672 2.8065 2.3107 5.2342 2.1659 2.1967 2.1023 1.4797 1.6881 1.2803 2.5359 3.1053 2.3176 1.1893 1.4314 1.3159 2.7242 1.3726 1.9496 1.7471 1.2333 1.4042 2.4344 5.0385 2.5451 1.1186 1.0436 1.0447 1.2470 1.8732 1.0515 1.2436 7.3028 7.5132 8.8979 6.6633 1.0494 1.0362 1.0499 1.0595 1.1008 1.0974 1.0977 1.1030 1.1024 1.1061 1.0863 1.0908 1.0913 1.0955 1.0982
irintensity: 1.3076 0.4408 0.4953 1.7967 0.6560 1.1089 1.5065 4.9683 0.6771 3.0650 1.3706 1.1871 3.6667 0.9221 4.0457 6.3166 8.0146 5.5055 7.1843 7.5058 2.6783 4.8027 3.9733 2.6683 3.4513 5.8760 1.1035 9.8391 5.6392 22.4938 84.9385 0.6859 2.4075 11.1059 5.0692 1.4979 26.0565 1.2291 56.9056 7.9884 3.8902 0.0861 23.1859 105.0290 17.0104 284.7312 29.6156 41.8160 59.8915 7.8328 55.9129 8.2464 43.2754 198.5033 55.4983 14.8502 48.7911 15.0470 72.3640 18.6300 9.8644 36.6050 26.7649 70.3207 49.3706 4.8567 6.0965 27.3697 11.5405 15.9245 56.0231 67.4131 13.9845 8.8857 28.7274 154.7641 249.6476 12.1959 23.2620 17.8649 22.6148 37.5590 3.3610 39.5012 24.7248 1.0038 32.5746 31.2605 5.1155 15.0468 2.7903 11.6625 20.3650
temp: 298.150 k
press: 1.00000 atm
elementType: 8 8 8 7 6 6 6 6 6 6 6 6 6 6 6 6 6 6 1 1 1 1 1 1 1 1 1 1 1 1 1 1 1
symmnumber: 1
zpe: 685897.2 jmol-1
zpe.correction: 0.261244 hartree
zpe.thermalcorrener: 0.278189 hartree
zpe.thermalcorrenthalpy: 0.279134 hartree
zpe.thermalcorrgfe: 0.215748 hartree
zpe.sumelectzpe: -821.602717 hartree
zpe.sumelectthermal: -821.585772 hartree
zpe.sumelectthermalent: -821.584828 hartree
zpe.sumelectthermalfe: -821.648213 hartree
dipole: -1.0672 2.2018 -0.9090
dipole: 2.6102
quadrupole: -82.3638 -101.7627 -110.2138
quadrupole: 4.1477 4.0333 -4.3483
quadrupole: 15.7497 -3.6493 -12.1004 4.1477 4.0333 -4.3483
hfenergy: -821.8639616 hartree
pointgroup: C01 [X(C14H15N1O3)]
dipole: -0.4148213 0.8932805 -0.2907928 debye
polarizability: 265.5789867|-5.2207931|181.2376946|16.5154366|20.8009255|96.608951 unknown
InChI: InChI=1S/C14H15NO3/c1-3-17-13-10-7-5-6-8-12(10)15-9-11(13)14(16)18-4-2/h5-9H,3-4H2,1-2H3
charge 0 multiplicity 1
33 atoms
O  0.267776 1.909812 0.277507
O  -2.946108 -0.758247 -1.116768
O  -2.679343 0.794576 0.60202
N  0.860569 -2.1693 -0.798723
C  1.688156 0.036504 0.011681
C  0.338562 0.566204 -0.030262
C  1.899556 -1.337771 -0.37665
C  -0.721617 -0.302446 -0.393626
C  2.807412 0.833572 0.407045
C  -0.371184 -1.649904 -0.794233
C  3.223136 -1.874201 -0.349896
C  4.092723 0.282224 0.429612
C  -0.821191 2.805036 -0.210502
C  -2.16691 0.005859 -0.237113
C  4.302506 -1.079519 0.049452
C  -0.228275 4.209547 -0.265059
C  -4.428396 -0.672007 -0.938117
C  -4.903315 -1.651104 0.139387
H  2.634427 1.873943 0.694955
H  -1.186027 -2.310387 -1.105934
H  3.349368 -2.918503 -0.65093
H  4.9454 0.89644 0.738738
H  -1.144751 2.45284 -1.209764
H  -1.671414 2.725087 0.485049
H  5.314465 -1.498898 0.069452
H  -1.007433 4.925991 -0.584571
H  0.133415 4.517531 0.731053
H  0.612682 4.265497 -0.977353
H  -4.691601 0.368417 -0.679199
H  -4.820162 -0.928813 -1.935202
H  -6.007401 -1.6318 0.199566
H  -4.589203 -2.682242 -0.097644
H  -4.500721 -1.372039 1.127531
